{"text_format":"2","workbook":"xlsx","n_sheets":4,"sheets":["Product Selector","Hidden","Product info","tmp"],"not_rendered":{"charts":0,"images":3,"macros":1,"external_links":0,"defined_names":4,"comments":0,"pivot_tables":0},"unopened":[],"bounds":{"document_bytes":16777216,"sheet_cells":100000,"run_cost":"one","rows_first":2000,"rows_last":500,"rows_between":2000,"halvings":0,"cell_chars":16384,"cell_head_chars":4096},"cells_cut":0,"cells_raw":0,"read":"whole","date_system":"1900"}

{"sheet":"Product Selector","index":0,"n_rows":251,"n_cols":11,"rows_kept":251,"cut":false,"hidden":false,"merged":[[38,1,40,1],[23,1,23,7],[3,4,3,6],[18,1,18,7],[26,1,28,1],[30,1,32,1],[34,1,36,1]]}
[null,null,"Product selector - Orion light guards"]
[]
[null,"Type of detection:",null,null,null,"T = Stop time for machine (s):",0.5]
[{"$nulls":4},"The chosen stop time and position affects 'S' in the result list"]
[null,"Protection height (mm):",null,null,null,"Direction of approach to light guard:"]
[null,"(Select type of detection first)"]
[null,"Operating distance* (m): ","enter value",null,null,"Is it possible to reach over light guard:"]
[null,"*Distance between transmitter and receiver or active and passive unit."]
[null,"Muting or blanking:",null,null,null,"Height of light guard (mm):"]
[]
[null,"Max. installation distance (mm):","enter value",null,null,"Height of hazard zone (mm):"]
[]
[]
[]
[]
[null,"Choose Product:"]
[]
[]
[null,"Mandatory Accessories"]
[null,null,"Artikelnummer","Description"]
[null,"Specific cable transmitter:",{"$f":"IF(Hidden!C40<>0,IF(LOOKUP(Hidden!C40,'Product info'!A4:A143,'Product info'!M4:M143)<>\"\",LOOKUP(Hidden!C40,'Product info'!A4:A143,'Product info'!M4:M143),\"not required\"),\"\")","v":""},{"$f":"IF(Hidden!C40<>0,IF(LOOKUP(Hidden!C40,'Product info'!A4:A143,'Product info'!N4:N143)<>\"\",LOOKUP(Hidden!C40,'Product info'!A4:A143,'Product info'!N4:N143),\"not required\"),\"\")","v":""}]
[null,"Specific cable receiver:",{"$f":"IF(Hidden!C40=0,\"\",IF(Hidden!B39=\"\",\"You need to choose Muting / No Muting\",IF(Hidden!B39=2,(IF(LOOKUP(Hidden!C40,'Product info'!A4:A143,'Product info'!O4:O143)<>\"\",LOOKUP(Hidden!C40,'Product info'!A4:A143,'Product info'!O4:O143),\"not required\")),(IF(LOOKUP(Hidden!C40,'Product info'!A4:A143,'Product info'!Q4:Q143)<>\"\",LOOKUP(Hidden!C40,'Product info'!A4:A143,'Product info'!Q4:Q143),\"not required\")))))","v":""},{"$f":"IF(Hidden!C40=0,\"\",IF(Hidden!B39=\"\",\"\",IF(Hidden!B39=2,(IF(LOOKUP(Hidden!C40,'Product info'!A4:A143,'Product info'!P4:P143)<>\"\",LOOKUP(Hidden!C40,'Product info'!A4:A143,'Product info'!P4:P143),\"not required\")),(IF(LOOKUP(Hidden!C40,'Product info'!A4:A143,'Product info'!R4:R143)<>\"\",LOOKUP(Hidden!C40,'Product info'!A4:A143,'Product info'!R4:R143),\"not required\")))))","v":""}]
[null,"Passive unit:",{"$f":"IF(Hidden!C40<>0,IF(LOOKUP(Hidden!C40,'Product info'!A4:A143,'Product info'!S4:S143)<>\"\",LOOKUP(Hidden!C40,'Product info'!A4:A143,'Product info'!S4:S143),\"not required\"),\"\")","v":""},{"$f":"IF(Hidden!C40<>0,IF(LOOKUP(Hidden!C40,'Product info'!A4:A143,'Product info'!T4:T143)<>\"\",LOOKUP(Hidden!C40,'Product info'!A4:A143,'Product info'!T4:T143),\"not required\"),\"\")","v":""}]
[null,"Optional Accessories"]
[null,null,"Artikelnummer","Description"]
[]
[null,"Cable between transmitter and electrical cabinet:",{"$f":"IF(Hidden!C40<>0,IF(LOOKUP(Hidden!C40,'Product info'!A4:A143,'Product info'!U4:U143)<>\"\",LOOKUP(Hidden!C40,'Product info'!A4:A143,'Product info'!U4:U143),\"\"),\"\")","v":""},{"$f":"IF(Hidden!C40<>0,IF(LOOKUP(Hidden!C40,'Product info'!A4:A143,'Product info'!V4:V143)<>\"\",LOOKUP(Hidden!C40,'Product info'!A4:A143,'Product info'!V4:V143)&\" (6 meter)\",\"\"),\"\")","v":""}]
[null,null,{"$f":"IF(Hidden!C40<>0,IF(LOOKUP(Hidden!C40,'Product info'!A4:A143,'Product info'!W4:W143)<>\"\",LOOKUP(Hidden!C40,'Product info'!A4:A143,'Product info'!W4:W143),\"\"),\"\")","v":""},{"$f":"IF(Hidden!C40<>0,IF(LOOKUP(Hidden!C40,'Product info'!A4:A143,'Product info'!X4:X143)<>\"\",LOOKUP(Hidden!C40,'Product info'!A4:A143,'Product info'!X4:X143)&\" (10 meter)\",\"\"),\"\")","v":""}]
[null,null,{"$f":"IF(Hidden!C40<>0,IF(LOOKUP(Hidden!C40,'Product info'!A4:A143,'Product info'!Y4:Y143)<>\"\",LOOKUP(Hidden!C40,'Product info'!A4:A143,'Product info'!Y4:Y143),\"\"),\"\")","v":""},{"$f":"IF(Hidden!C40<>0,IF(LOOKUP(Hidden!C40,'Product info'!A4:A143,'Product info'!Z4:Z143)<>\"\",LOOKUP(Hidden!C40,'Product info'!A4:A143,'Product info'!Z4:Z143)&\" (20 meter)\",\"\"),\"\")","v":""}]
[]
[null,"Cable between receiver and electrical cabinet:",{"$f":"IF(Hidden!C40<>0,IF(LOOKUP(Hidden!C40,'Product info'!A4:A143,'Product info'!AA4:AA143)<>\"\",LOOKUP(Hidden!C40,'Product info'!A4:A143,'Product info'!AA4:AA143),\"\"),\"\")","v":""},{"$f":"IF(Hidden!C40<>0,IF(LOOKUP(Hidden!C40,'Product info'!A4:A143,'Product info'!AB4:AB143)<>\"\",LOOKUP(Hidden!C40,'Product info'!A4:A143,'Product info'!AB4:AB143)&\" (6 meter)\",\"\"),\"\")","v":""}]
[null,null,{"$f":"IF(Hidden!C40<>0,IF(LOOKUP(Hidden!C40,'Product info'!A4:A143,'Product info'!AC4:AC143)<>\"\",LOOKUP(Hidden!C40,'Product info'!A4:A143,'Product info'!AC4:AC143),\"\"),\"\")","v":""},{"$f":"IF(Hidden!C40<>0,IF(LOOKUP(Hidden!C40,'Product info'!A4:A143,'Product info'!AD4:AD143)<>\"\",LOOKUP(Hidden!C40,'Product info'!A4:A143,'Product info'!AD4:AD143)&\" (10 meter)\",\"\"),\"\")","v":""}]
[null,null,{"$f":"IF(Hidden!C40<>0,IF(LOOKUP(Hidden!C40,'Product info'!A4:A143,'Product info'!AE4:AE143)<>\"\",LOOKUP(Hidden!C40,'Product info'!A4:A143,'Product info'!AE4:AE143),\"\"),\"\")","v":""},{"$f":"IF(Hidden!C40<>0,IF(LOOKUP(Hidden!C40,'Product info'!A4:A143,'Product info'!AF4:AF143)<>\"\",LOOKUP(Hidden!C40,'Product info'!A4:A143,'Product info'!AF4:AF143)&\" (20 meter)\",\"\"),\"\")","v":""}]
[]
[null,"Cable between active unit and electrical cabinet:",{"$f":"IF(Hidden!C40<>0,IF(LOOKUP(Hidden!C40,'Product info'!A4:A143,'Product info'!AG4:AG143)<>\"\",LOOKUP(Hidden!C40,'Product info'!A4:A143,'Product info'!AG4:AG143),\"\"),\"\")","v":""},{"$f":"IF(Hidden!C40<>0,IF(LOOKUP(Hidden!C40,'Product info'!A4:A143,'Product info'!AH4:AH143)<>\"\",LOOKUP(Hidden!C40,'Product info'!A4:A143,'Product info'!AH4:AH143)&\" (6 meter)\",\"\"),\"\")","v":""}]
[null,null,{"$f":"IF(Hidden!C40<>0,IF(LOOKUP(Hidden!C40,'Product info'!A4:A143,'Product info'!AI4:AI143)<>\"\",LOOKUP(Hidden!C40,'Product info'!A4:A143,'Product info'!AI4:AI143),\"\"),\"\")","v":""},{"$f":"IF(Hidden!C40<>0,IF(LOOKUP(Hidden!C40,'Product info'!A4:A143,'Product info'!AJ4:AJ143)<>\"\",LOOKUP(Hidden!C40,'Product info'!A4:A143,'Product info'!AJ4:AJ143)&\" (10 meter)\",\"\"),\"\")","v":""}]
[null,null,{"$f":"IF(Hidden!C40<>0,IF(LOOKUP(Hidden!C40,'Product info'!A4:A143,'Product info'!AK4:AK143)<>\"\",LOOKUP(Hidden!C40,'Product info'!A4:A143,'Product info'!AK4:AK143),\"\"),\"\")","v":""},{"$f":"IF(Hidden!C40<>0,IF(LOOKUP(Hidden!C40,'Product info'!A4:A143,'Product info'!AL4:AL143)<>\"\",LOOKUP(Hidden!C40,'Product info'!A4:A143,'Product info'!AL4:AL143)&\" (20 meter)\",\"\"),\"\")","v":""}]
[]
[null,{"$f":"IF(Hidden!B39=2,\"Cable between receiver and muting sensors:\",\"\")","v":""},{"$f":"IF(Hidden!C40<>0,IF(B39<>\"\",IF(LOOKUP(Hidden!C40,'Product info'!A4:A143,'Product info'!AM4:AM143)<>\"\",LOOKUP(Hidden!C40,'Product info'!A4:A143,'Product info'!AM4:AM143),\"\"),\"\"),\"\")","v":""},{"$f":"IF(Hidden!C40<>0,IF(B39<>\"\",IF(LOOKUP(Hidden!C40,'Product info'!A4:A143,'Product info'!AN4:AN143)<>\"\",LOOKUP(Hidden!C40,'Product info'!A4:A143,'Product info'!AN4:AN143)&\" (6 meter)\",\"\"),\"\"),\"\")","v":""}]
[null,null,{"$f":"IF(Hidden!C40<>0,IF(B39<>\"\",IF(LOOKUP(Hidden!C40,'Product info'!A4:A143,'Product info'!AO4:AO143)<>\"\",LOOKUP(Hidden!C40,'Product info'!A4:A143,'Product info'!AO4:AO143),\"\"),\"\"),\"\")","v":""},{"$f":"IF(Hidden!C40<>0,IF(B39<>\"\",IF(LOOKUP(Hidden!C40,'Product info'!A4:A143,'Product info'!AP4:AP143)<>\"\",LOOKUP(Hidden!C40,'Product info'!A4:A143,'Product info'!AP4:AP143)&\" (10 meter)\",\"\"),\"\"),\"\")","v":""}]
[null,null,{"$f":"IF(Hidden!C40<>0,IF(B39<>\"\",IF(LOOKUP(Hidden!C40,'Product info'!A4:A143,'Product info'!AQ4:AQ143)<>\"\",LOOKUP(Hidden!C40,'Product info'!A4:A143,'Product info'!AQ4:AQ143),\"\"),\"\"),\"\")","v":""},{"$f":"IF(Hidden!C40<>0,IF(B39<>\"\",IF(LOOKUP(Hidden!C40,'Product info'!A4:A143,'Product info'!AR4:AR143)<>\"\",LOOKUP(Hidden!C40,'Product info'!A4:A143,'Product info'!AR4:AR143)&\" (20 meter)\",\"\"),\"\"),\"\")","v":""}]
[null,"Protective tube.",{"$f":"IF(Hidden!C40<>0,IF((LOOKUP(Hidden!C40,'Product info'!A4:A143,'Product info'!AS4:AS143)=\"None\"),(\"Not available for this model\"),(IF(LOOKUP(Hidden!C40,'Product info'!A4:A143,'Product info'!AS4:AS143)<>\"\",LOOKUP(Hidden!C40,'Product info'!A4:A143,'Product info'!AS4:AS143),\"\"))),\"\")","v":""},{"$f":"IF(Hidden!C40<>0,IF(LOOKUP(Hidden!C40,'Product info'!A4:A143,'Product info'!AT4:AT143)<>\"\",LOOKUP(Hidden!C40,'Product info'!A4:A143,'Product info'!AT4:AT143),\"\"),\"\")","v":""}]
[null,"Protective stand:",{"$f":"IF(Hidden!C40<>0,IF((LOOKUP(Hidden!C40,'Product info'!A4:A143,'Product info'!AU4:AU143)=\"None\"),(\"Not available for this model\"),(IF(LOOKUP(Hidden!C40,'Product info'!A4:A143,'Product info'!AU4:AU143)<>\"\",LOOKUP(Hidden!C40,'Product info'!A4:A143,'Product info'!AU4:AU143),\"\"))),\"\")","v":""},{"$f":"IF(Hidden!C40<>0,IF(LOOKUP(Hidden!C40,'Product info'!A4:A143,'Product info'!AV4:AV143)<>\"\",LOOKUP(Hidden!C40,'Product info'!A4:A143,'Product info'!AV4:AV143),\"\"),\"\")","v":""},null,null,{"$f":"IF(LEFT(Hidden!D40,6)=\"Orion3\",\"Recommendation: Order two stands\",\"\")","v":{"$error":"#N/A"}}]
[null,"Lens shield:",{"$f":"IF(Hidden!C40<>0,IF((LOOKUP(Hidden!C40,'Product info'!A4:A143,'Product info'!AW4:AW143)=\"None\"),(\"Not available for this model\"),(IF(LOOKUP(Hidden!C40,'Product info'!A4:A143,'Product info'!AW4:AW143)<>\"\",LOOKUP(Hidden!C40,'Product info'!A4:A143,'Product info'!AW4:AW143),\"\"))),\"\")","v":""},{"$f":"IF(Hidden!C40<>0,IF(LOOKUP(Hidden!C40,'Product info'!A4:A143,'Product info'!AX4:AX143)<>\"\",LOOKUP(Hidden!C40,'Product info'!A4:A143,'Product info'!AX4:AX143),\"\"),\"\")","v":""}]
[null,"Deviating mirror:",{"$f":"IF(Hidden!C40<>0,IF((LOOKUP(Hidden!C40,'Product info'!A4:A143,'Product info'!AY4:AY143)=\"None\"),(\"Not available for this model\"),(IF(LOOKUP(Hidden!C40,'Product info'!A4:A143,'Product info'!AY4:AY143)<>\"\",LOOKUP(Hidden!C40,'Product info'!A4:A143,'Product info'!AY4:AY143),\"\"))),\"\")","v":""},{"$f":"IF(Hidden!C40<>0,IF(LOOKUP(Hidden!C40,'Product info'!A4:A143,'Product info'!AZ4:AZ143)<>\"\",LOOKUP(Hidden!C40,'Product info'!A4:A143,'Product info'!AZ4:AZ143),\"\"),\"\")","v":""}]
[null,"Laser pointer:",{"$f":"IF(Hidden!C40<>0,IF((LOOKUP(Hidden!C40,'Product info'!A4:A143,'Product info'!BA4:BA143)=\"None\"),(\"Not available for this model\"),(IF(LOOKUP(Hidden!C40,'Product info'!A4:A143,'Product info'!BA4:BA143)<>\"\",LOOKUP(Hidden!C40,'Product info'!A4:A143,'Product info'!BA4:BA143),\"\"))),\"\")","v":""},{"$f":"IF(Hidden!C40<>0,IF(LOOKUP(Hidden!C40,'Product info'!A4:A143,'Product info'!BB4:BB143)<>\"\",LOOKUP(Hidden!C40,'Product info'!A4:A143,'Product info'!BB4:BB143),\"\"),\"\")","v":""}]
[null,"Test piece:",{"$f":"IF(Hidden!C40<>0,IF((LOOKUP(Hidden!C40,'Product info'!A4:A143,'Product info'!BC4:BC143)=\"None\"),(\"Not available for this model\"),(IF(LOOKUP(Hidden!C40,'Product info'!A4:A143,'Product info'!BC4:BC143)<>\"\",LOOKUP(Hidden!C40,'Product info'!A4:A143,'Product info'!BC4:BC143),\"\"))),\"\")","v":""},{"$f":"IF(Hidden!C40<>0,IF(LOOKUP(Hidden!C40,'Product info'!A4:A143,'Product info'!BD4:BD143)<>\"\",LOOKUP(Hidden!C40,'Product info'!A4:A143,'Product info'!BD4:BD143),\"\"),\"\")","v":""}]
[null,"Angle brackets as spare parts:",{"$f":"IF(Hidden!C40<>0,IF((LOOKUP(Hidden!C40,'Product info'!A4:A143,'Product info'!BE4:BE143)=\"None\"),(\"Not available for this model\"),(IF(LOOKUP(Hidden!C40,'Product info'!A4:A143,'Product info'!BE4:BE143)<>\"\",LOOKUP(Hidden!C40,'Product info'!A4:A143,'Product info'!BE4:BE143),\"\"))),\"\")","v":""},{"$f":"IF(Hidden!C40<>0,IF(LOOKUP(Hidden!C40,'Product info'!A4:A143,'Product info'!BF4:BF143)<>\"\",LOOKUP(Hidden!C40,'Product info'!A4:A143,'Product info'!BF4:BF143),\"\"),\"\")","v":""}]
[null,"Rotation bracket:",{"$f":"IF(Hidden!C40<>0,IF((LOOKUP(Hidden!C40,'Product info'!A4:A143,'Product info'!BG4:BG143)=\"None\"),(\"Not available for this model\"),(IF(LOOKUP(Hidden!C40,'Product info'!A4:A143,'Product info'!BG4:BG143)<>\"\",LOOKUP(Hidden!C40,'Product info'!A4:A143,'Product info'!BG4:BG143),\"\"))),\"\")","v":""},{"$f":"IF(Hidden!C40<>0,IF(LOOKUP(Hidden!C40,'Product info'!A4:A143,'Product info'!BH4:BH143)<>\"\",LOOKUP(Hidden!C40,'Product info'!A4:A143,'Product info'!BH4:BH143),\"\"),\"\")","v":""}]
[]
[null,"Article number","Description","Type of Detection","Protected height (mm) ","S= Minimum installation distance (mm).","Height of the product incl. Connector (mm)","Operating distance min (m)","Operating distance max (m)","Response time (ms) ","Muting/Blanking"]
[1,"2TLA022300R0000","Orion1-4-14-015-B  Transmitter+ Receiver","Finger",150,800,233.3,0.2,6,11,"No"]
[2,"2TLA022300R0100","Orion1-4-14-030-B  Transmitter+ Receiver","Finger",300,800,383.2,0.2,6,15,"No"]
[3,"2TLA022300R0200","Orion1-4-14-045-B  Transmitter+ Receiver","Finger",450,800,533.20000000000005,0.2,6,18,"No"]
[4,"2TLA022300R0300","Orion1-4-14-060-B  Transmitter+ Receiver","Finger",600,800,683.2,0.2,6,22,"No"]
[5,"2TLA022300R0400","Orion1-4-14-075-B  Transmitter+ Receiver","Finger",750,800,833.2,0.2,6,25,"No"]
[6,"2TLA022300R0500","Orion1-4-14-090-B  Transmitter+ Receiver","Finger",900,800,983.2,0.2,6,29,"No"]
[7,"2TLA022300R0600","Orion1-4-14-105-B  Transmitter+ Receiver","Finger",1050,800,1133.2,0.2,6,33,"No"]
[8,"2TLA022300R0700","Orion1-4-14-120-B  Transmitter+ Receiver","Finger",1200,800,1283.3,0.2,6,36,"No"]
[9,"2TLA022300R0800","Orion1-4-14-135-B  Transmitter+ Receiver","Finger",1350,800,1433.2,0.2,6,40,"No"]
[10,"2TLA022300R0900","Orion1-4-14-150-B  Transmitter+ Receiver","Finger",1500,800,1583.3,0.2,6,43,"No"]
[11,"2TLA022300R1000","Orion1-4-14-165-B  Transmitter+ Receiver","Finger",1650,800,1733.3,0.2,6,47,"No"]
[12,"2TLA022300R1100","Orion1-4-14-180-B  Transmitter+ Receiver","Finger",1800,800,1883.3,0.2,6,50,"No"]
[13,"2TLA022301R0100","Orion1-4-14-030-E  Transmitter+ Receiver","Finger",300,800,306.3,0.2,7,15,"Muting, blanking"]
[14,"2TLA022301R0200","Orion1-4-14-045-E  Transmitter+ Receiver","Finger",450,800,456.3,0.2,7,17,"Muting, blanking"]
[15,"2TLA022301R0300","Orion1-4-14-060-E  Transmitter+ Receiver","Finger",600,800,606.29999999999995,0.2,7,19,"Muting, blanking"]
[16,"2TLA022301R0400","Orion1-4-14-075-E  Transmitter+ Receiver","Finger",750,800,756.3,0.2,7,20,"Muting, blanking"]
[17,"2TLA022301R0500","Orion1-4-14-090-E  Transmitter+ Receiver","Finger",900,800,906.3,0.2,7,22,"Muting, blanking"]
[18,"2TLA022301R0600","Orion1-4-14-105-E  Transmitter+ Receiver","Finger",1050,800,1056.3,0.2,7,24,"Muting, blanking"]
[19,"2TLA022301R0700","Orion1-4-14-120-E  Transmitter+ Receiver","Finger",1200,800,1206.3,0.2,7,26,"Muting, blanking"]
[20,"2TLA022301R0800","Orion1-4-14-135-E  Transmitter+ Receiver","Finger",1350,800,1356.3,0.2,7,27,"Muting, blanking"]
[21,"2TLA022301R0900","Orion1-4-14-150-E  Transmitter+ Receiver","Finger",1500,800,1506.3,0.2,7,29,"Muting, blanking"]
[22,"2TLA022301R1000","Orion1-4-14-165-E  Transmitter+ Receiver","Finger",1650,800,1656.3,0.2,7,31,"Muting, blanking"]
[23,"2TLA022301R1100","Orion1-4-14-180-E  Transmitter+ Receiver","Finger",1800,800,1806.3,0.2,7,33,"Muting, blanking"]
[24,"2TLA022302R0000","Orion1-4-30-015-B  Transmitter+ Receiver","Hand",150,928,233.3,0.2,19,9,"No"]
[25,"2TLA022302R0100","Orion1-4-30-030-B  Transmitter+ Receiver","Hand",300,928,383.2,0.2,19,11,"No"]
[26,"2TLA022302R0200","Orion1-4-30-045-B  Transmitter+ Receiver","Hand",450,928,533.20000000000005,0.2,19,13,"No"]
[27,"2TLA022302R0300","Orion1-4-30-060-B  Transmitter+ Receiver","Hand",600,928,683.2,0.2,19,14,"No"]
[28,"2TLA022302R0400","Orion1-4-30-075-B  Transmitter+ Receiver","Hand",750,928,833.2,0.2,19,16,"No"]
[29,"2TLA022302R0500","Orion1-4-30-090-B  Transmitter+ Receiver","Hand",900,928,983.2,0.2,19,18,"No"]
[30,"2TLA022302R0600","Orion1-4-30-105-B  Transmitter+ Receiver","Hand",1050,928,1133.2,0.2,19,19,"No"]
[31,"2TLA022302R0700","Orion1-4-30-120-B  Transmitter+ Receiver","Hand",1200,928,1283.3,0.2,19,21,"No"]
[32,"2TLA022302R0800","Orion1-4-30-135-B  Transmitter+ Receiver","Hand",1350,928,1433.2,0.2,19,23,"No"]
[33,"2TLA022302R0900","Orion1-4-30-150-B  Transmitter+ Receiver","Hand",1500,928,1583.3,0.2,19,25,"No"]
[34,"2TLA022302R1000","Orion1-4-30-165-B  Transmitter+ Receiver","Hand",1650,928,1733.3,0.2,19,26,"No"]
[35,"2TLA022302R1100","Orion1-4-30-180-B  Transmitter+ Receiver","Hand",1800,928,1883.3,0.2,19,28,"No"]
[36,"2TLA022303R0100","Orion1-4-30-030-E  Transmitter+ Receiver","Hand",300,928,306.3,0.2,20,13,"Muting, blanking"]
[37,"2TLA022303R0200","Orion1-4-30-045-E  Transmitter+ Receiver","Hand",450,928,456.3,0.2,20,14,"Muting, blanking"]
[38,"2TLA022303R0300","Orion1-4-30-060-E  Transmitter+ Receiver","Hand",600,928,606.29999999999995,0.2,20,15,"Muting, blanking"]
[39,"2TLA022303R0400","Orion1-4-30-075-E  Transmitter+ Receiver","Hand",750,928,756.3,0.2,20,16,"Muting, blanking"]
[40,"2TLA022303R0500","Orion1-4-30-090-E  Transmitter+ Receiver","Hand",900,928,906.3,0.2,20,17,"Muting, blanking"]
[41,"2TLA022303R0600","Orion1-4-30-105-E  Transmitter+ Receiver","Hand",1050,928,1056.3,0.2,20,18,"Muting, blanking"]
[42,"2TLA022303R0700","Orion1-4-30-120-E  Transmitter+ Receiver","Hand",1200,928,1206.3,0.2,20,19,"Muting, blanking"]
[43,"2TLA022303R0800","Orion1-4-30-135-E  Transmitter+ Receiver","Hand",1350,928,1356.3,0.2,20,19,"Muting, blanking"]
[44,"2TLA022303R0900","Orion1-4-30-150-E  Transmitter+ Receiver","Hand",1500,928,1506.3,0.2,20,20,"Muting, blanking"]
[45,"2TLA022303R1000","Orion1-4-30-165-E  Transmitter+ Receiver","Hand",1650,928,1656.3,0.2,20,21,"Muting, blanking"]
[46,"2TLA022303R1100","Orion1-4-30-180-E  Transmitter+ Receiver","Hand",1800,928,1806.3,0.2,20,22,"Muting, blanking"]
[47,"2TLA022304R0000","Orion2-4-K2-050-B Transmitter+ Receiver ","Body",500,1650,664,0.5,50,14,"No"]
[48,"2TLA022304R0100","Orion2-4-K3-080-B Transmitter+ Receiver ","Body",800,1650,964,0.5,50,14,"No"]
[49,"2TLA022304R0200","Orion2-4-K4-090-B Transmitter+ Receiver ","Body",900,1650,1064,0.5,50,16,"No"]
[50,"2TLA022304R0300","Orion2-4-K4-120-B Transmitter+ Receiver ","Body",1200,1650,1364,0.5,50,16,"No"]
[51,"2TLA022305R0000","Orion2-4-K2-050-E Transmitter+ Receiver ","Body",500,1650,664,0.5,50,14,"Muting"]
[52,"2TLA022305R0100","Orion2-4-K3-080-E Transmitter+ Receiver ","Body",800,1650,964,0.5,50,14,"Muting"]
[53,"2TLA022305R0200","Orion2-4-K4-090-E Transmitter+ Receiver ","Body",900,1650,1064,0.5,50,16,"Muting"]
[54,"2TLA022305R0300","Orion2-4-K4-120-E  Transmitter+ Receiver","Body",1200,1650,1364,0.5,50,16,"Muting"]
[55,"2TLA022306R0000","Orion3-4-K1C-050-B - Active unit","Body",500,1650,606.35,0.5,8,11,"No"]
[56,"2TLA022306R0100","Orion3-4-K2C-080-B - Active unit","Body",800,1650,906.35,0.5,8,12,"No"]
[57,"2TLA022306R0200","Orion3-4-K2C-090-B - Active unit","Body",900,1650,1006.35,0.5,6.5,12,"No"]
[58,"2TLA022306R0300","Orion3-4-K2C-120-B - Active unit","Body",1200,1650,1306.3499999999999,0.5,8,12,"No"]
[59,"2TLA022307R0000","Orion3-4-K1C-050-E - Active unit","Body",500,1650,606.35,0.5,8,11,"Muting"]
[60,"2TLA022307R0100","Orion3-4-K2C-080-E - Active unit","Body",800,1650,906.35,0.5,8,12,"Muting"]
[61,"2TLA022307R0200","Orion3-4-K2C-090-E - Active unit","Body",900,1650,1006.35,0.5,6.5,12,"Muting"]
[62,"2TLA022307R0300","Orion3-4-K2C-120-E - Active unit","Body",1200,1650,1306.3499999999999,0.5,8,12,"Muting"]
[63]
[64]
[65]
[66]
[67]
[68]
[69]
[70]
[71]
[72]
[73]
[74]
[75]
[76]
[77]
[78]
[79]
[80]
[81]
[82]
[83]
[84]
[85]
[86]
[87]
[88]
[89]
[90]
[91]
[92]
[93]
[94]
[95]
[96]
[97]
[98]
[99]
[100]
[101]
[102]
[103]
[104]
[105]
[106]
[107]
[108]
[109]
[110]
[111]
[112]
[113]
[114]
[115]
[116]
[117]
[118]
[119]
[120]
[121]
[122]
[123]
[124]
[125]
[126]
[127]
[128]
[129]
[130]
[131]
[132]
[133]
[134]
[135]
[136]
[137]
[138]
[139]
[140]
[141]
[142]
[143]
[144]
[145]
[146]
[147]
[148]
[149]
[150]
[151]
[152]
[153]
[154]
[155]
[156]
[157]
[158]
[159]
[160]
[161]
[162]
[163]
[164]
[165]
[166]
[167]
[168]
[169]
[170]
[171]
[172]
[173]
[174]
[175]
[176]
[177]
[178]
[179]
[180]
[181]
[182]
[183]
[184]
[185]
[186]
[187]
[188]
[189]
[190]
[191]
[192]
[193]
[194]
[195]
[196]
[197]
[198]
[199]
[200]

{"sheet":"Hidden","index":1,"n_rows":351,"n_cols":20,"rows_kept":351,"cut":false,"hidden":true,"merged":[[46,0,46,1]]}
["Type of detection"]
["Don't know"]
["Finger (14 mm)"]
["Hand (30 mm)"]
["Finger or hand"]
["Body "]
[]
["Protection height"]
[]
[150,150,1,500]
[300,300,2,800]
[450,450,3,900]
[600,600,4,1200]
[750,750,5]
[900,900,6]
[1050,1050,7]
[1200,1200,8]
[1350,1350,9]
[1500,1500,10]
[1650,1650,11]
[1800,1800,12]
[null,"500 (2 beams)"]
[null,"800 (3 beams)"]
[null,"900 (4 beams)","VH"]
[null,"1200 (4 beams)","Vertical"]
[null,null,"Horizontal"]
[]
["Muting, Blanking?"]
[null,null,"Is it possible to reach over light guard:",null,null,null,"Height of light guard (mm):"]
["No",null,"Yes",null,null,null,"ESPE height:"]
["Muting",null,"No",null,null,null,1,2,3,4,5,6,7,8,9,10,11,12,null,"Height of light guard (mm):"]
["Blanking",{"$nulls":4},"Cro",900,1000,1100,1200,1300,1400,1600,1800,2000,2200,2400,2600,null,900]
[null,null,null,"Hazard height:",1,2600,0,0,0,0,0,0,0,0,0,0,0,0,null,1000]
[{"$nulls":4},2,2500,400,400,350,300,300,300,300,300,250,150,100,0,null,1100]
[{"$nulls":4},3,2400,550,550,550,500,450,450,400,400,300,250,100,0,null,1200]
[{"$nulls":4},4,2200,800,750,750,700,650,650,600,550,400,250,0,0,null,1300]
["Type of detection:",1,"Kommentar: 2=finger, 3 = hand, 4 = finger or hand, 5 = body",null,5,2000,950,950,850,850,800,750,700,550,400,0,0,0,null,1400]
["Protection H",null,{"$f":"IF(B38=\"\",9999,IF(B37=5,LOOKUP(B38,C10:C21,D10:D21),LOOKUP(B38,C10:C21,A10:A21)))","v":9999},null,6,1800,1100,1100,950,950,850,800,750,550,0,0,0,0,null,1600]
["Muting and/or blanking?",null,"Kommentar: 1=No, 2=Muting, 3=Blanking",null,7,1600,1150,1150,1100,1000,900,850,750,450,0,0,0,0,null,1800]
["product",null,{"$f":"IF(B40<>\"\",LOOKUP(B$40,'Product Selector'!A$52:A$210,'Product Selector'!B$52:B$210),0)","v":0},{"$f":"LOOKUP(B$40,'Product Selector'!A$52:A$210,'Product Selector'!C$52:C$210)","v":{"$error":"#N/A"}},8,1400,1200,1200,1100,1000,900,850,650,0,0,0,0,0,null,2000]
[{"$nulls":4},9,1200,1200,1200,1100,1000,850,800,0,0,0,0,0,0,null,2200]
[{"$nulls":4},10,1000,1200,1150,1050,950,750,700,0,0,0,0,0,0,null,2400]
[{"$nulls":4},11,800,1150,1050,950,800,500,450,0,0,0,0,0,0,null,2600]
["Cable between transmitter and electrical cabinet",null,null,null,12,600,1050,950,750,550,0,0,0,0,0,0,0,0]
["Cable between receiver and electrical cabinet",null,null,null,13,400,900,700,0,0,0,0,0,0,0,0,0,0]
["Cable between active unit and electrical cabinet",null,null,null,14,200,600,0,0,0,0,0,0,0,0,0,0,0]
[0,null,null,null,15,0,0,0,0,0,0,0,0,0,0,0,0,0]
[]
[{"$nulls":6},{"$f":"HLOOKUP(B51,E31:R47,B50+2)","v":950}]
["Height of hazard zone (mm):",6]
["Height of light guard (mm):",4,{"$f":"LOOKUP(B51,G31:R31,G32:R32)","v":1200}]
["Is it possible to reach over light guard:",2,"kommentar 1=yes, 2 = no"]
["Direction of approach to light guard:",1,"kommentar 1=vertikal, 2 = horiz…"]
{"$rows_empty":98}
[1]
[2]
[3]
[4]
[5]
[6]
[7]
[8]
[9]
[10]
[11]
[12]
[13]
[14]
[15]
[16]
[17]
[18]
[19]
[20]
[21]
[22]
[23]
[24]
[25]
[26]
[27]
[28]
[29]
[30]
[31]
[32]
[33]
[34]
[35]
[36]
[37]
[38]
[39]
[40]
[41]
[42]
[43]
[44]
[45]
[46]
[47]
[48]
[49]
[50]
[51]
[52]
[53]
[54]
[55]
[56]
[57]
[58]
[59]
[60]
[61]
[62]
[63]
[64]
[65]
[66]
[67]
[68]
[69]
[70]
[71]
[72]
[73]
[74]
[75]
[76]
[77]
[78]
[79]
[80]
[81]
[82]
[83]
[84]
[85]
[86]
[87]
[88]
[89]
[90]
[91]
[92]
[93]
[94]
[95]
[96]
[97]
[98]
[99]
[100]
[101]
[102]
[103]
[104]
[105]
[106]
[107]
[108]
[109]
[110]
[111]
[112]
[113]
[114]
[115]
[116]
[117]
[118]
[119]
[120]
[121]
[122]
[123]
[124]
[125]
[126]
[127]
[128]
[129]
[130]
[131]
[132]
[133]
[134]
[135]
[136]
[137]
[138]
[139]
[140]
[141]
[142]
[143]
[144]
[145]
[146]
[147]
[148]
[149]
[150]
[151]
[152]
[153]
[154]
[155]
[156]
[157]
[158]
[159]
[160]
[161]
[162]
[163]
[164]
[165]
[166]
[167]
[168]
[169]
[170]
[171]
[172]
[173]
[174]
[175]
[176]
[177]
[178]
[179]
[180]
[181]
[182]
[183]
[184]
[185]
[186]
[187]
[188]
[189]
[190]
[191]
[192]
[193]
[194]
[195]
[196]
[197]
[198]
[199]
[200]

{"sheet":"Product info","index":2,"n_rows":145,"n_cols":65,"rows_kept":145,"cut":false,"hidden":true,"merged":[[2,40,2,41],[2,42,2,43],[2,28,2,29],[2,30,2,31],[2,32,2,33],[2,34,2,35],[2,36,2,37],[2,38,2,39],[1,52,1,53],[1,54,1,55],[1,56,1,57],[1,58,1,59],[2,14,2,15],[2,16,2,17],[2,20,2,21],[2,22,2,23],[2,24,2,25],[2,26,2,27],[1,32,1,37],[1,38,1,43],[1,44,1,45],[1,46,1,47],[1,48,1,49],[1,50,1,51],[1,26,1,31],[0,12,0,19],[1,12,1,13],[1,14,1,17],[1,18,1,19],[1,20,1,25]]}
[{"$nulls":12},"Don't forget"]
["Artikelnummer","Description\n","Type of Detection","Type ","Protected height (mm) ","Number of beams ","Response time (ms) ","Resolution (mm) ","Height of the product incl, Connector (mm)","Height of the product excl, Connector (mm)","Operating distance min (m)","Operating distance max (m)","Specific cable transmitter",null,"Specific cable receiver",null,null,null,"Passive unit",null,"Cable between transmitter and electrical cabinet",{"$nulls":5},"Cable between receiver and electrical cabinet",{"$nulls":5},"Cable between active unit and electrical cabinet",{"$nulls":5},"Cable between receiver and muting sensors\n(endast om \"muting\" har valts)",{"$nulls":5},"Protective tube",null,"Protective stand",null,"Lens shield",null,"Deviating mirror",null,"Laser pointer",null,"Test piece (not delivered with product)",null,"Angle brackets as spare parts (delivered with product)",null,"Rotation bracket",null,"Muting","S-max","K","Cmax","C"]
[{"$nulls":14},"Muting",null,"No muting",null,null,null,"6 m",null,"10 m",null,"20  m",null,"6 m",null,"10 m",null,"20  m",null,"6 m",null,"10 m",null,"20  m",null,"6 m",null,"10 m",null,"20  m"]
["2TLA022300R0000","Orion1-4-14-015-B  Transmitter+ Receiver","Finger","Orion1-4-14-015-B",150,16,11,14,233.3,153.30000000000001,0.2,6,{"$nulls":8},"2TLA020056R0000","M12-C61","2TLA020056R1000","M12-C101","2TLA020056R1400","M12-C201","2TLA020056R3000","M12-C63","2TLA020056R4000","M12-C103","2TLA020056R4100","M12-C203",{"$nulls":12},"2TLA022313R0000",{"$f":"IF(AS4=\"None\",\" - \",VLOOKUP(AS4,$A$4:$D$143,4,FALSE))","v":"Orion WET-015"},"2TLA022312R0000",{"$f":"IF(AU4=\"None\",\" - \",VLOOKUP(AU4,$A$4:$D$143,4,FALSE))","v":"Orion Stand 060"},"2TLA022313R5000",{"$f":"IF(AW4=\"None\",\" - \",VLOOKUP(AW4,$A$4:$D$143,4,FALSE))","v":"Orion Shield-015"},"1 pc 2TLA022311R0100\n 1 pc 2TLA022310R0900\n1 pc 2TLA022312R0000","Orion1 Mirror 060\nJSM Orion11\nOrion Stand 060","2TLA022310R5000",{"$f":"IF(BA4=\"None\",\" - \",VLOOKUP(BA4,$A$4:$D$143,4,FALSE))","v":"Orion Laser"},"2TLA022310R5200",{"$f":"IF(BC4=\"None\",\" - \",VLOOKUP(BC4,$A$4:$D$143,4,FALSE))","v":"Orion TP-14"},"2TLA022310R0000",{"$f":"IF(BE4=\"None\",\" - \",VLOOKUP(BE4,$A$4:$D$143,4,FALSE))","v":"JSM Orion01"},"2TLA022310R0100",{"$f":"IF(BG4=\"None\",\" - \",VLOOKUP(BG4,$A$4:$D$143,4,FALSE))","v":"JSM Orion03"},"No",{"$f":"IF('Product Selector'!G$3=\"\",\"\",IF(Hidden!B$53=2,IF(Hidden!C$51=\"\",\"\",(1600*'Product Selector'!G$3+IF((1200-0.4*Hidden!C$51)<850,850,(1200-0.4*(Hidden!C$51))))),IF(Hidden!C$51=\"\",\"\",IF((BK4*'Product Selector'!G$3+BL4)>500,IF((1600*'Product Selector'!G$3+BL4)<500,500,(1600*'Product Selector'!G$3+BL4)),BK4*'Product Selector'!G$3+BL4))))","v":800},{"$f":"IF(OR(C4=\"finger\",C4=\"hand\"),2000,1600)","v":2000},{"$f":"IF(Hidden!B$52=1,MAX(Hidden!G$49,BM4),BM4)","v":0},{"$f":"IF(C4=\"finger\",0,IF(C4=\"Hand\",128,850))","v":0}]
["2TLA022300R0100","Orion1-4-14-030-B  Transmitter+ Receiver","Finger","Orion1-4-14-030-B",300,32,15,14,383.2,303.2,0.2,6,{"$nulls":8},"2TLA020056R0000","M12-C61","2TLA020056R1000","M12-C101","2TLA020056R1400","M12-C201","2TLA020056R3000","M12-C63","2TLA020056R4000","M12-C103","2TLA020056R4100","M12-C203",{"$nulls":12},"2TLA022313R0100",{"$f":"IF(AS5=\"None\",\" - \",VLOOKUP(AS5,$A$4:$D$143,4,FALSE))","v":"Orion WET-030"},"2TLA022312R0000","Orion Stand 060","2TLA022313R5100",{"$f":"IF(AW5=\"None\",\" - \",VLOOKUP(AW5,$A$4:$D$143,4,FALSE))","v":"Orion Shield-030"},"1 pc 2TLA022311R0100\n 1 pc 2TLA022310R0900\n1 pc 2TLA022312R0000","Orion1 Mirror 060\nJSM Orion11\nOrion Stand 060","2TLA022310R5000",{"$f":"IF(BA5=\"None\",\" - \",VLOOKUP(BA5,$A$4:$D$143,4,FALSE))","v":"Orion Laser"},"2TLA022310R5200",{"$f":"IF(BC5=\"None\",\" - \",VLOOKUP(BC5,$A$4:$D$143,4,FALSE))","v":"Orion TP-14"},"2TLA022310R0000",{"$f":"IF(BE5=\"None\",\" - \",VLOOKUP(BE5,$A$4:$D$143,4,FALSE))","v":"JSM Orion01"},"2TLA022310R0100",{"$f":"IF(BG5=\"None\",\" - \",VLOOKUP(BG5,$A$4:$D$143,4,FALSE))","v":"JSM Orion03"},"No",{"$f":"IF('Product Selector'!G$3=\"\",\"\",IF(Hidden!B$53=2,IF(Hidden!C$51=\"\",\"\",(1600*'Product Selector'!G$3+IF((1200-0.4*Hidden!C$51)<850,850,(1200-0.4*(Hidden!C$51))))),IF(Hidden!C$51=\"\",\"\",IF((BK5*'Product Selector'!G$3+BL5)>500,IF((1600*'Product Selector'!G$3+BL5)<500,500,(1600*'Product Selector'!G$3+BL5)),BK5*'Product Selector'!G$3+BL5))))","v":800},{"$f":"IF(OR(C5=\"finger\",C5=\"hand\"),2000,1600)","v":2000},{"$f":"IF(Hidden!B$52=1,MAX(Hidden!G$49,BM5),BM5)","v":0},{"$f":"IF(C5=\"finger\",0,IF(C5=\"Hand\",128,850))","v":0}]
["2TLA022300R0200","Orion1-4-14-045-B  Transmitter+ Receiver","Finger","Orion1-4-14-045-B",450,48,18,14,533.20000000000005,453.3,0.2,6,{"$nulls":8},"2TLA020056R0000","M12-C61","2TLA020056R1000","M12-C101","2TLA020056R1400","M12-C201","2TLA020056R3000","M12-C63","2TLA020056R4000","M12-C103","2TLA020056R4100","M12-C203",{"$nulls":12},"2TLA022313R0200","Orion WET-045","2TLA022312R0000","Orion Stand 060","2TLA022313R5200","Orion Shield-045","1 pc 2TLA022311R0100\n 1 pc 2TLA022310R0900\n1 pc 2TLA022312R0000","Orion1 Mirror 060\nJSM Orion11\nOrion Stand 060","2TLA022310R5000","Orion Laser","2TLA022310R5200","Orion TP-14","2TLA022310R0000","JSM Orion01","2TLA022310R0100","JSM Orion03","No",{"$f":"IF('Product Selector'!G$3=\"\",\"\",IF(Hidden!B$53=2,IF(Hidden!C$51=\"\",\"\",(1600*'Product Selector'!G$3+IF((1200-0.4*Hidden!C$51)<850,850,(1200-0.4*(Hidden!C$51))))),IF(Hidden!C$51=\"\",\"\",IF((BK6*'Product Selector'!G$3+BL6)>500,IF((1600*'Product Selector'!G$3+BL6)<500,500,(1600*'Product Selector'!G$3+BL6)),BK6*'Product Selector'!G$3+BL6))))","v":800},2000,{"$f":"IF(Hidden!B$52=1,MAX(Hidden!G$49,BM6),BM6)","v":0},0]
["2TLA022300R0300","Orion1-4-14-060-B  Transmitter+ Receiver","Finger","Orion1-4-14-060-B",600,64,22,14,683.2,603.20000000000005,0.2,6,{"$nulls":8},"2TLA020056R0000","M12-C61","2TLA020056R1000","M12-C101","2TLA020056R1400","M12-C201","2TLA020056R3000","M12-C63","2TLA020056R4000","M12-C103","2TLA020056R4100","M12-C203",{"$nulls":12},"2TLA022313R0300","Orion WET-060","2TLA022312R0100","Orion Stand 100","2TLA022313R5300","Orion Shield-060","1 pc 2TLA022311R0200\n 1 pc 2TLA022310R0900\n1 pc 2TLA022312R0100","Orion1 Mirror 090\nJSM Orion11\nOrion Stand 100","2TLA022310R5000","Orion Laser","2TLA022310R5200","Orion TP-14","2TLA022310R0000","JSM Orion01","2TLA022310R0100","JSM Orion03","No",{"$f":"IF('Product Selector'!G$3=\"\",\"\",IF(Hidden!B$53=2,IF(Hidden!C$51=\"\",\"\",(1600*'Product Selector'!G$3+IF((1200-0.4*Hidden!C$51)<850,850,(1200-0.4*(Hidden!C$51))))),IF(Hidden!C$51=\"\",\"\",IF((BK7*'Product Selector'!G$3+BL7)>500,IF((1600*'Product Selector'!G$3+BL7)<500,500,(1600*'Product Selector'!G$3+BL7)),BK7*'Product Selector'!G$3+BL7))))","v":800},2000,{"$f":"IF(Hidden!B$52=1,MAX(Hidden!G$49,BM7),BM7)","v":0},0]
["2TLA022300R0400","Orion1-4-14-075-B  Transmitter+ Receiver","Finger","Orion1-4-14-075-B",750,80,25,14,833.2,753.3,0.2,6,{"$nulls":8},"2TLA020056R0000","M12-C61","2TLA020056R1000","M12-C101","2TLA020056R1400","M12-C201","2TLA020056R3000","M12-C63","2TLA020056R4000","M12-C103","2TLA020056R4100","M12-C203",{"$nulls":12},"2TLA022313R0400","Orion WET-075","2TLA022312R0100","Orion Stand 100","2TLA022313R5400","Orion Shield-075","1 pc 2TLA022311R0200\n 1 pc 2TLA022310R0900\n1 pc 2TLA022312R0100","Orion1 Mirror 090\nJSM Orion11\nOrion Stand 100","2TLA022310R5000","Orion Laser","2TLA022310R5200","Orion TP-14","2TLA022310R0000","JSM Orion01","2TLA022310R0100","JSM Orion03","No",{"$f":"IF('Product Selector'!G$3=\"\",\"\",IF(Hidden!B$53=2,IF(Hidden!C$51=\"\",\"\",(1600*'Product Selector'!G$3+IF((1200-0.4*Hidden!C$51)<850,850,(1200-0.4*(Hidden!C$51))))),IF(Hidden!C$51=\"\",\"\",IF((BK8*'Product Selector'!G$3+BL8)>500,IF((1600*'Product Selector'!G$3+BL8)<500,500,(1600*'Product Selector'!G$3+BL8)),BK8*'Product Selector'!G$3+BL8))))","v":800},2000,{"$f":"IF(Hidden!B$52=1,MAX(Hidden!G$49,BM8),BM8)","v":0},0]
["2TLA022300R0500","Orion1-4-14-090-B  Transmitter+ Receiver","Finger","Orion1-4-14-090-B",900,96,29,14,983.2,903.2,0.2,6,{"$nulls":8},"2TLA020056R0000","M12-C61","2TLA020056R1000","M12-C101","2TLA020056R1400","M12-C201","2TLA020056R3000","M12-C63","2TLA020056R4000","M12-C103","2TLA020056R4100","M12-C203",{"$nulls":12},"2TLA022313R0500","Orion WET-090","2TLA022312R0200","Orion Stand 120","2TLA022313R5500","Orion Shield-090","1 pc 2TLA022311R0300\n 1 pc 2TLA022310R0900\n1 pc 2TLA022312R0200","Orion1 Mirror 120\nJSM Orion11\nOrion Stand 120","2TLA022310R5000","Orion Laser","2TLA022310R5200","Orion TP-14","2TLA022310R0000","JSM Orion01","2TLA022310R0100","JSM Orion03","No",{"$f":"IF('Product Selector'!G$3=\"\",\"\",IF(Hidden!B$53=2,IF(Hidden!C$51=\"\",\"\",(1600*'Product Selector'!G$3+IF((1200-0.4*Hidden!C$51)<850,850,(1200-0.4*(Hidden!C$51))))),IF(Hidden!C$51=\"\",\"\",IF((BK9*'Product Selector'!G$3+BL9)>500,IF((1600*'Product Selector'!G$3+BL9)<500,500,(1600*'Product Selector'!G$3+BL9)),BK9*'Product Selector'!G$3+BL9))))","v":800},2000,{"$f":"IF(Hidden!B$52=1,MAX(Hidden!G$49,BM9),BM9)","v":0},0]
["2TLA022300R0600","Orion1-4-14-105-B  Transmitter+ Receiver","Finger","Orion1-4-14-105-B",1050,112,33,14,1133.2,1053.2,0.2,6,{"$nulls":8},"2TLA020056R0000","M12-C61","2TLA020056R1000","M12-C101","2TLA020056R1400","M12-C201","2TLA020056R3000","M12-C63","2TLA020056R4000","M12-C103","2TLA020056R4100","M12-C203",{"$nulls":12},"2TLA022313R0600","Orion WET-105","2TLA022312R0200","Orion Stand 120","2TLA022313R5600","Orion Shield-105","1 pc 2TLA022311R0300\n 1 pc 2TLA022310R0900\n1 pc 2TLA022312R0200","Orion1 Mirror 120\nJSM Orion11\nOrion Stand 120","2TLA022310R5000","Orion Laser","2TLA022310R5200","Orion TP-14","2TLA022310R0000","JSM Orion01","2TLA022310R0100","JSM Orion03","No",{"$f":"IF('Product Selector'!G$3=\"\",\"\",IF(Hidden!B$53=2,IF(Hidden!C$51=\"\",\"\",(1600*'Product Selector'!G$3+IF((1200-0.4*Hidden!C$51)<850,850,(1200-0.4*(Hidden!C$51))))),IF(Hidden!C$51=\"\",\"\",IF((BK10*'Product Selector'!G$3+BL10)>500,IF((1600*'Product Selector'!G$3+BL10)<500,500,(1600*'Product Selector'!G$3+BL10)),BK10*'Product Selector'!G$3+BL10))))","v":800},2000,{"$f":"IF(Hidden!B$52=1,MAX(Hidden!G$49,BM10),BM10)","v":0},0]
["2TLA022300R0700","Orion1-4-14-120-B  Transmitter+ Receiver","Finger","Orion1-4-14-120-B",1200,128,36,14,1283.3,1203.3,0.2,6,{"$nulls":8},"2TLA020056R0000","M12-C61","2TLA020056R1000","M12-C101","2TLA020056R1400","M12-C201","2TLA020056R3000","M12-C63","2TLA020056R4000","M12-C103","2TLA020056R4100","M12-C203",{"$nulls":12},"2TLA022313R0700","Orion WET-120","2TLA022312R0300","Orion Stand 165","2TLA022313R5700","Orion Shield-120","1 pc 2TLA022311R0400\n 1 pc 2TLA022310R0900\n1 pc 2TLA022312R0300","Orion1 Mirror 165\nJSM Orion11\nOrion Stand 165","2TLA022310R5000","Orion Laser","2TLA022310R5200","Orion TP-14","2TLA022310R0000","JSM Orion01","2TLA022310R0100","JSM Orion03","No",{"$f":"IF('Product Selector'!G$3=\"\",\"\",IF(Hidden!B$53=2,IF(Hidden!C$51=\"\",\"\",(1600*'Product Selector'!G$3+IF((1200-0.4*Hidden!C$51)<850,850,(1200-0.4*(Hidden!C$51))))),IF(Hidden!C$51=\"\",\"\",IF((BK11*'Product Selector'!G$3+BL11)>500,IF((1600*'Product Selector'!G$3+BL11)<500,500,(1600*'Product Selector'!G$3+BL11)),BK11*'Product Selector'!G$3+BL11))))","v":800},2000,{"$f":"IF(Hidden!B$52=1,MAX(Hidden!G$49,BM11),BM11)","v":0},0]
["2TLA022300R0800","Orion1-4-14-135-B  Transmitter+ Receiver","Finger","Orion1-4-14-135-B",1350,144,40,14,1433.2,1353.2,0.2,6,{"$nulls":8},"2TLA020056R0000","M12-C61","2TLA020056R1000","M12-C101","2TLA020056R1400","M12-C201","2TLA020056R3000","M12-C63","2TLA020056R4000","M12-C103","2TLA020056R4100","M12-C203",{"$nulls":12},"2TLA022313R0800","Orion WET-135","2TLA022312R0300","Orion Stand 165","2TLA022313R5800","Orion Shield-135","1 pc 2TLA022311R0400\n 1 pc 2TLA022310R0900\n1 pc 2TLA022312R0300","Orion1 Mirror 165\nJSM Orion11\nOrion Stand 165","2TLA022310R5000","Orion Laser","2TLA022310R5200","Orion TP-14","2TLA022310R0000","JSM Orion01","2TLA022310R0100","JSM Orion03","No",{"$f":"IF('Product Selector'!G$3=\"\",\"\",IF(Hidden!B$53=2,IF(Hidden!C$51=\"\",\"\",(1600*'Product Selector'!G$3+IF((1200-0.4*Hidden!C$51)<850,850,(1200-0.4*(Hidden!C$51))))),IF(Hidden!C$51=\"\",\"\",IF((BK12*'Product Selector'!G$3+BL12)>500,IF((1600*'Product Selector'!G$3+BL12)<500,500,(1600*'Product Selector'!G$3+BL12)),BK12*'Product Selector'!G$3+BL12))))","v":800},2000,{"$f":"IF(Hidden!B$52=1,MAX(Hidden!G$49,BM12),BM12)","v":0},0]
["2TLA022300R0900","Orion1-4-14-150-B  Transmitter+ Receiver","Finger","Orion1-4-14-150-B",1500,160,43,14,1583.3,1503.3,0.2,6,{"$nulls":8},"2TLA020056R0000","M12-C61","2TLA020056R1000","M12-C101","2TLA020056R1400","M12-C201","2TLA020056R3000","M12-C63","2TLA020056R4000","M12-C103","2TLA020056R4100","M12-C203",{"$nulls":12},"2TLA022313R0900","Orion WET-150","2TLA022312R0300","Orion Stand 165","2TLA022313R5900","Orion Shield-150","1 pc 2TLA022311R0400\n 1 pc 2TLA022310R0900\n1 pc 2TLA022312R0300","Orion1 Mirror 165\nJSM Orion11\nOrion Stand 165","2TLA022310R5000","Orion Laser","2TLA022310R5200","Orion TP-14","2TLA022310R0000","JSM Orion01","2TLA022310R0100","JSM Orion03","No",{"$f":"IF('Product Selector'!G$3=\"\",\"\",IF(Hidden!B$53=2,IF(Hidden!C$51=\"\",\"\",(1600*'Product Selector'!G$3+IF((1200-0.4*Hidden!C$51)<850,850,(1200-0.4*(Hidden!C$51))))),IF(Hidden!C$51=\"\",\"\",IF((BK13*'Product Selector'!G$3+BL13)>500,IF((1600*'Product Selector'!G$3+BL13)<500,500,(1600*'Product Selector'!G$3+BL13)),BK13*'Product Selector'!G$3+BL13))))","v":800},2000,{"$f":"IF(Hidden!B$52=1,MAX(Hidden!G$49,BM13),BM13)","v":0},0]
["2TLA022300R1000","Orion1-4-14-165-B  Transmitter+ Receiver","Finger","Orion1-4-14-165-B",1650,176,47,14,1733.3,1653.3,0.2,6,{"$nulls":8},"2TLA020056R0000","M12-C61","2TLA020056R1000","M12-C101","2TLA020056R1400","M12-C201","2TLA020056R3000","M12-C63","2TLA020056R4000","M12-C103","2TLA020056R4100","M12-C203",{"$nulls":12},"2TLA022313R1000","Orion WET-165","2TLA022312R0400","Orion Stand 190","2TLA022313R6000","Orion Shield-165","1 pc 2TLA022311R0500\n 1 pc 2TLA022310R0900\n1 pc 2TLA022312R0400","Orion1 Mirror 190\nJSM Orion11\nOrion Stand 190","2TLA022310R5000","Orion Laser","2TLA022310R5200","Orion TP-14","2TLA022310R0000","JSM Orion01","2TLA022310R0100","JSM Orion03","No",{"$f":"IF('Product Selector'!G$3=\"\",\"\",IF(Hidden!B$53=2,IF(Hidden!C$51=\"\",\"\",(1600*'Product Selector'!G$3+IF((1200-0.4*Hidden!C$51)<850,850,(1200-0.4*(Hidden!C$51))))),IF(Hidden!C$51=\"\",\"\",IF((BK14*'Product Selector'!G$3+BL14)>500,IF((1600*'Product Selector'!G$3+BL14)<500,500,(1600*'Product Selector'!G$3+BL14)),BK14*'Product Selector'!G$3+BL14))))","v":800},2000,{"$f":"IF(Hidden!B$52=1,MAX(Hidden!G$49,BM14),BM14)","v":0},0]
["2TLA022300R1100","Orion1-4-14-180-B  Transmitter+ Receiver","Finger","Orion1-4-14-180-B",1800,192,50,14,1883.3,1803.3,0.2,6,{"$nulls":8},"2TLA020056R0000","M12-C61","2TLA020056R1000","M12-C101","2TLA020056R1400","M12-C201","2TLA020056R3000","M12-C63","2TLA020056R4000","M12-C103","2TLA020056R4100","M12-C203",{"$nulls":12},"2TLA022313R1100","Orion WET-180","2TLA022312R0400","Orion Stand 190","2TLA022313R6100","Orion Shield-180","1 pc 2TLA022311R0500\n 1 pc 2TLA022310R0900\n1 pc 2TLA022312R0400","Orion1 Mirror 190\nJSM Orion11\nOrion Stand 190","2TLA022310R5000","Orion Laser","2TLA022310R5200","Orion TP-14","2TLA022310R0000","JSM Orion01","2TLA022310R0100","JSM Orion03","No",{"$f":"IF('Product Selector'!G$3=\"\",\"\",IF(Hidden!B$53=2,IF(Hidden!C$51=\"\",\"\",(1600*'Product Selector'!G$3+IF((1200-0.4*Hidden!C$51)<850,850,(1200-0.4*(Hidden!C$51))))),IF(Hidden!C$51=\"\",\"\",IF((BK15*'Product Selector'!G$3+BL15)>500,IF((1600*'Product Selector'!G$3+BL15)<500,500,(1600*'Product Selector'!G$3+BL15)),BK15*'Product Selector'!G$3+BL15))))","v":800},2000,{"$f":"IF(Hidden!B$52=1,MAX(Hidden!G$49,BM15),BM15)","v":0},0]
["2TLA022301R0100","Orion1-4-14-030-E  Transmitter+ Receiver","Finger","Orion1-4-14-030-E",300,32,15,14,306.3,null,0.2,7,"2TLA022315R0100",{"$f":"IF(M16=\"None\",\" - \",VLOOKUP(M16,$A$4:$D$143,4,FALSE))","v":"M12-C02PT2T"},"2TLA022315R0300",{"$f":"IF(O16=\"None\",\" - \",VLOOKUP(O16,$A$4:$D$143,4,FALSE))","v":"M12-C02PT62RM"},"2TLA022315R0200",{"$f":"IF(Q16=\"None\",\" - \",VLOOKUP(Q16,$A$4:$D$143,4,FALSE))","v":"M12-C02PT6RB"},null,null,"2TLA020056R0000","M12-C61","2TLA020056R1000","M12-C101","2TLA020056R1400","M12-C201","2TLA020056R7200","M12-C65","2TLA020056R7300","M12-C105","2TLA020056R7500","M12-C205",{"$nulls":6},"2TLA020056R0000","M12-C61","2TLA020056R1000","M12-C101","2TLA020056R1400","M12-C201","None"," - ","2TLA022312R0000","Orion Stand 060","None"," - ","1 pc 2TLA022311R0100\n 1 pc 2TLA022310R0900\n1 pc 2TLA022312R0000","Orion1 Mirror 060\nJSM Orion11\nOrion Stand 060","2TLA022310R5000","Orion Laser","2TLA022310R5200","Orion TP-14","2TLA022310R0000","JSM Orion01","None"," - ","Muting, blanking",{"$f":"IF('Product Selector'!G$3=\"\",\"\",IF(Hidden!B$53=2,IF(Hidden!C$51=\"\",\"\",(1600*'Product Selector'!G$3+IF((1200-0.4*Hidden!C$51)<850,850,(1200-0.4*(Hidden!C$51))))),IF(Hidden!C$51=\"\",\"\",IF((BK16*'Product Selector'!G$3+BL16)>500,IF((1600*'Product Selector'!G$3+BL16)<500,500,(1600*'Product Selector'!G$3+BL16)),BK16*'Product Selector'!G$3+BL16))))","v":800},2000,{"$f":"IF(Hidden!B$52=1,MAX(Hidden!G$49,BM16),BM16)","v":0},0]
["2TLA022301R0200","Orion1-4-14-045-E  Transmitter+ Receiver","Finger","Orion1-4-14-045-E",450,48,17,14,456.3,null,0.2,7,"2TLA022315R0100","M12-C02PT2T","2TLA022315R0300","M12-C02PT62RM","2TLA022315R0200","M12-C02PT6RB",null,null,"2TLA020056R0000","M12-C61","2TLA020056R1000","M12-C101","2TLA020056R1400","M12-C201","2TLA020056R7200","M12-C65","2TLA020056R7300","M12-C105","2TLA020056R7500","M12-C205",{"$nulls":6},"2TLA020056R0000","M12-C61","2TLA020056R1000","M12-C101","2TLA020056R1400","M12-C201","None"," - ","2TLA022312R0000","Orion Stand 060","None"," - ","1 pc 2TLA022311R0100\n 1 pc 2TLA022310R0900\n1 pc 2TLA022312R0000","Orion1 Mirror 060\nJSM Orion11\nOrion Stand 060","2TLA022310R5000","Orion Laser","2TLA022310R5200","Orion TP-14","2TLA022310R0000","JSM Orion01","None"," - ","Muting, blanking",{"$f":"IF('Product Selector'!G$3=\"\",\"\",IF(Hidden!B$53=2,IF(Hidden!C$51=\"\",\"\",(1600*'Product Selector'!G$3+IF((1200-0.4*Hidden!C$51)<850,850,(1200-0.4*(Hidden!C$51))))),IF(Hidden!C$51=\"\",\"\",IF((BK17*'Product Selector'!G$3+BL17)>500,IF((1600*'Product Selector'!G$3+BL17)<500,500,(1600*'Product Selector'!G$3+BL17)),BK17*'Product Selector'!G$3+BL17))))","v":800},2000,{"$f":"IF(Hidden!B$52=1,MAX(Hidden!G$49,BM17),BM17)","v":0},0]
["2TLA022301R0300","Orion1-4-14-060-E  Transmitter+ Receiver","Finger","Orion1-4-14-060-E",600,64,19,14,606.29999999999995,null,0.2,7,"2TLA022315R0100","M12-C02PT2T","2TLA022315R0300","M12-C02PT62RM","2TLA022315R0200","M12-C02PT6RB",null,null,"2TLA020056R0000","M12-C61","2TLA020056R1000","M12-C101","2TLA020056R1400","M12-C201","2TLA020056R7200","M12-C65","2TLA020056R7300","M12-C105","2TLA020056R7500","M12-C205",{"$nulls":6},"2TLA020056R0000","M12-C61","2TLA020056R1000","M12-C101","2TLA020056R1400","M12-C201","None"," - ","2TLA022312R0100","Orion Stand 100","None"," - ","1 pc 2TLA022311R0200\n 1 pc 2TLA022310R0900\n1 pc 2TLA022312R0100","Orion1 Mirror 090\nJSM Orion11\nOrion Stand 100","2TLA022310R5000","Orion Laser","2TLA022310R5200","Orion TP-14","2TLA022310R0000","JSM Orion01","None"," - ","Muting, blanking",{"$f":"IF('Product Selector'!G$3=\"\",\"\",IF(Hidden!B$53=2,IF(Hidden!C$51=\"\",\"\",(1600*'Product Selector'!G$3+IF((1200-0.4*Hidden!C$51)<850,850,(1200-0.4*(Hidden!C$51))))),IF(Hidden!C$51=\"\",\"\",IF((BK18*'Product Selector'!G$3+BL18)>500,IF((1600*'Product Selector'!G$3+BL18)<500,500,(1600*'Product Selector'!G$3+BL18)),BK18*'Product Selector'!G$3+BL18))))","v":800},2000,{"$f":"IF(Hidden!B$52=1,MAX(Hidden!G$49,BM18),BM18)","v":0},0]
["2TLA022301R0400","Orion1-4-14-075-E  Transmitter+ Receiver","Finger","Orion1-4-14-075-E",750,80,20,14,756.3,null,0.2,7,"2TLA022315R0100","M12-C02PT2T","2TLA022315R0300","M12-C02PT62RM","2TLA022315R0200","M12-C02PT6RB",null,null,"2TLA020056R0000","M12-C61","2TLA020056R1000","M12-C101","2TLA020056R1400","M12-C201","2TLA020056R7200","M12-C65","2TLA020056R7300","M12-C105","2TLA020056R7500","M12-C205",{"$nulls":6},"2TLA020056R0000","M12-C61","2TLA020056R1000","M12-C101","2TLA020056R1400","M12-C201","None"," - ","2TLA022312R0100","Orion Stand 100","None"," - ","1 pc 2TLA022311R0200\n 1 pc 2TLA022310R0900\n1 pc 2TLA022312R0100","Orion1 Mirror 090\nJSM Orion11\nOrion Stand 100","2TLA022310R5000","Orion Laser","2TLA022310R5200","Orion TP-14","2TLA022310R0000","JSM Orion01","None"," - ","Muting, blanking",{"$f":"IF('Product Selector'!G$3=\"\",\"\",IF(Hidden!B$53=2,IF(Hidden!C$51=\"\",\"\",(1600*'Product Selector'!G$3+IF((1200-0.4*Hidden!C$51)<850,850,(1200-0.4*(Hidden!C$51))))),IF(Hidden!C$51=\"\",\"\",IF((BK19*'Product Selector'!G$3+BL19)>500,IF((1600*'Product Selector'!G$3+BL19)<500,500,(1600*'Product Selector'!G$3+BL19)),BK19*'Product Selector'!G$3+BL19))))","v":800},2000,{"$f":"IF(Hidden!B$52=1,MAX(Hidden!G$49,BM19),BM19)","v":0},0]
["2TLA022301R0500","Orion1-4-14-090-E  Transmitter+ Receiver","Finger","Orion1-4-14-090-E",900,96,22,14,906.3,null,0.2,7,"2TLA022315R0100","M12-C02PT2T","2TLA022315R0300","M12-C02PT62RM","2TLA022315R0200","M12-C02PT6RB",null,null,"2TLA020056R0000","M12-C61","2TLA020056R1000","M12-C101","2TLA020056R1400","M12-C201","2TLA020056R7200","M12-C65","2TLA020056R7300","M12-C105","2TLA020056R7500","M12-C205",{"$nulls":6},"2TLA020056R0000","M12-C61","2TLA020056R1000","M12-C101","2TLA020056R1400","M12-C201","None"," - ","2TLA022312R0200","Orion Stand 120","None"," - ","1 pc 2TLA022311R0300\n 1 pc 2TLA022310R0900\n1 pc 2TLA022312R0200","Orion1 Mirror 120\nJSM Orion11\nOrion Stand 120","2TLA022310R5000","Orion Laser","2TLA022310R5200","Orion TP-14","2TLA022310R0000","JSM Orion01","None"," - ","Muting, blanking",{"$f":"IF('Product Selector'!G$3=\"\",\"\",IF(Hidden!B$53=2,IF(Hidden!C$51=\"\",\"\",(1600*'Product Selector'!G$3+IF((1200-0.4*Hidden!C$51)<850,850,(1200-0.4*(Hidden!C$51))))),IF(Hidden!C$51=\"\",\"\",IF((BK20*'Product Selector'!G$3+BL20)>500,IF((1600*'Product Selector'!G$3+BL20)<500,500,(1600*'Product Selector'!G$3+BL20)),BK20*'Product Selector'!G$3+BL20))))","v":800},2000,{"$f":"IF(Hidden!B$52=1,MAX(Hidden!G$49,BM20),BM20)","v":0},0]
["2TLA022301R0600","Orion1-4-14-105-E  Transmitter+ Receiver","Finger","Orion1-4-14-105-E",1050,112,24,14,1056.3,null,0.2,7,"2TLA022315R0100","M12-C02PT2T","2TLA022315R0300","M12-C02PT62RM","2TLA022315R0200","M12-C02PT6RB",null,null,"2TLA020056R0000","M12-C61","2TLA020056R1000","M12-C101","2TLA020056R1400","M12-C201","2TLA020056R7200","M12-C65","2TLA020056R7300","M12-C105","2TLA020056R7500","M12-C205",{"$nulls":6},"2TLA020056R0000","M12-C61","2TLA020056R1000","M12-C101","2TLA020056R1400","M12-C201","None"," - ","2TLA022312R0200","Orion Stand 120","None"," - ","1 pc 2TLA022311R0300\n 1 pc 2TLA022310R0900\n1 pc 2TLA022312R0200","Orion1 Mirror 120\nJSM Orion11\nOrion Stand 120","2TLA022310R5000","Orion Laser","2TLA022310R5200","Orion TP-14","2TLA022310R0000","JSM Orion01","None"," - ","Muting, blanking",{"$f":"IF('Product Selector'!G$3=\"\",\"\",IF(Hidden!B$53=2,IF(Hidden!C$51=\"\",\"\",(1600*'Product Selector'!G$3+IF((1200-0.4*Hidden!C$51)<850,850,(1200-0.4*(Hidden!C$51))))),IF(Hidden!C$51=\"\",\"\",IF((BK21*'Product Selector'!G$3+BL21)>500,IF((1600*'Product Selector'!G$3+BL21)<500,500,(1600*'Product Selector'!G$3+BL21)),BK21*'Product Selector'!G$3+BL21))))","v":800},2000,{"$f":"IF(Hidden!B$52=1,MAX(Hidden!G$49,BM21),BM21)","v":0},0]
["2TLA022301R0700","Orion1-4-14-120-E  Transmitter+ Receiver","Finger","Orion1-4-14-120-E",1200,128,26,14,1206.3,null,0.2,7,"2TLA022315R0100","M12-C02PT2T","2TLA022315R0300","M12-C02PT62RM","2TLA022315R0200","M12-C02PT6RB",null,null,"2TLA020056R0000","M12-C61","2TLA020056R1000","M12-C101","2TLA020056R1400","M12-C201","2TLA020056R7200","M12-C65","2TLA020056R7300","M12-C105","2TLA020056R7500","M12-C205",{"$nulls":6},"2TLA020056R0000","M12-C61","2TLA020056R1000","M12-C101","2TLA020056R1400","M12-C201","None"," - ","2TLA022312R0300","Orion Stand 165","None"," - ","1 pc 2TLA022311R0400\n 1 pc 2TLA022310R0900\n1 pc 2TLA022312R0300","Orion1 Mirror 165\nJSM Orion11\nOrion Stand 165","2TLA022310R5000","Orion Laser","2TLA022310R5200","Orion TP-14","2TLA022310R0000","JSM Orion01","None"," - ","Muting, blanking",{"$f":"IF('Product Selector'!G$3=\"\",\"\",IF(Hidden!B$53=2,IF(Hidden!C$51=\"\",\"\",(1600*'Product Selector'!G$3+IF((1200-0.4*Hidden!C$51)<850,850,(1200-0.4*(Hidden!C$51))))),IF(Hidden!C$51=\"\",\"\",IF((BK22*'Product Selector'!G$3+BL22)>500,IF((1600*'Product Selector'!G$3+BL22)<500,500,(1600*'Product Selector'!G$3+BL22)),BK22*'Product Selector'!G$3+BL22))))","v":800},2000,{"$f":"IF(Hidden!B$52=1,MAX(Hidden!G$49,BM22),BM22)","v":0},0]
["2TLA022301R0800","Orion1-4-14-135-E  Transmitter+ Receiver","Finger","Orion1-4-14-135-E",1350,144,27,14,1356.3,null,0.2,7,"2TLA022315R0100","M12-C02PT2T","2TLA022315R0300","M12-C02PT62RM","2TLA022315R0200","M12-C02PT6RB",null,null,"2TLA020056R0000","M12-C61","2TLA020056R1000","M12-C101","2TLA020056R1400","M12-C201","2TLA020056R7200","M12-C65","2TLA020056R7300","M12-C105","2TLA020056R7500","M12-C205",{"$nulls":6},"2TLA020056R0000","M12-C61","2TLA020056R1000","M12-C101","2TLA020056R1400","M12-C201","None"," - ","2TLA022312R0300","Orion Stand 165","None"," - ","1 pc 2TLA022311R0400\n 1 pc 2TLA022310R0900\n1 pc 2TLA022312R0300","Orion1 Mirror 165\nJSM Orion11\nOrion Stand 165","2TLA022310R5000","Orion Laser","2TLA022310R5200","Orion TP-14","2TLA022310R0000","JSM Orion01","None"," - ","Muting, blanking",{"$f":"IF('Product Selector'!G$3=\"\",\"\",IF(Hidden!B$53=2,IF(Hidden!C$51=\"\",\"\",(1600*'Product Selector'!G$3+IF((1200-0.4*Hidden!C$51)<850,850,(1200-0.4*(Hidden!C$51))))),IF(Hidden!C$51=\"\",\"\",IF((BK23*'Product Selector'!G$3+BL23)>500,IF((1600*'Product Selector'!G$3+BL23)<500,500,(1600*'Product Selector'!G$3+BL23)),BK23*'Product Selector'!G$3+BL23))))","v":800},2000,{"$f":"IF(Hidden!B$52=1,MAX(Hidden!G$49,BM23),BM23)","v":0},0]
["2TLA022301R0900","Orion1-4-14-150-E  Transmitter+ Receiver","Finger","Orion1-4-14-150-E",1500,160,29,14,1506.3,null,0.2,7,"2TLA022315R0100","M12-C02PT2T","2TLA022315R0300","M12-C02PT62RM","2TLA022315R0200","M12-C02PT6RB",null,null,"2TLA020056R0000","M12-C61","2TLA020056R1000","M12-C101","2TLA020056R1400","M12-C201","2TLA020056R7200","M12-C65","2TLA020056R7300","M12-C105","2TLA020056R7500","M12-C205",{"$nulls":6},"2TLA020056R0000","M12-C61","2TLA020056R1000","M12-C101","2TLA020056R1400","M12-C201","None"," - ","2TLA022312R0300","Orion Stand 165","None"," - ","1 pc 2TLA022311R0400\n 1 pc 2TLA022310R0900\n1 pc 2TLA022312R0300","Orion1 Mirror 165\nJSM Orion11\nOrion Stand 165","2TLA022310R5000","Orion Laser","2TLA022310R5200","Orion TP-14","2TLA022310R0000","JSM Orion01","None"," - ","Muting, blanking",{"$f":"IF('Product Selector'!G$3=\"\",\"\",IF(Hidden!B$53=2,IF(Hidden!C$51=\"\",\"\",(1600*'Product Selector'!G$3+IF((1200-0.4*Hidden!C$51)<850,850,(1200-0.4*(Hidden!C$51))))),IF(Hidden!C$51=\"\",\"\",IF((BK24*'Product Selector'!G$3+BL24)>500,IF((1600*'Product Selector'!G$3+BL24)<500,500,(1600*'Product Selector'!G$3+BL24)),BK24*'Product Selector'!G$3+BL24))))","v":800},2000,{"$f":"IF(Hidden!B$52=1,MAX(Hidden!G$49,BM24),BM24)","v":0},0]
["2TLA022301R1000","Orion1-4-14-165-E  Transmitter+ Receiver","Finger","Orion1-4-14-165-E",1650,176,31,14,1656.3,null,0.2,7,"2TLA022315R0100","M12-C02PT2T","2TLA022315R0300","M12-C02PT62RM","2TLA022315R0200","M12-C02PT6RB",null,null,"2TLA020056R0000","M12-C61","2TLA020056R1000","M12-C101","2TLA020056R1400","M12-C201","2TLA020056R7200","M12-C65","2TLA020056R7300","M12-C105","2TLA020056R7500","M12-C205",{"$nulls":6},"2TLA020056R0000","M12-C61","2TLA020056R1000","M12-C101","2TLA020056R1400","M12-C201","None"," - ","2TLA022312R0400","Orion Stand 190","None"," - ","1 pc 2TLA022311R0500\n 1 pc 2TLA022310R0900\n1 pc 2TLA022312R0400","Orion1 Mirror 190\nJSM Orion11\nOrion Stand 190","2TLA022310R5000","Orion Laser","2TLA022310R5200","Orion TP-14","2TLA022310R0000","JSM Orion01","None"," - ","Muting, blanking",{"$f":"IF('Product Selector'!G$3=\"\",\"\",IF(Hidden!B$53=2,IF(Hidden!C$51=\"\",\"\",(1600*'Product Selector'!G$3+IF((1200-0.4*Hidden!C$51)<850,850,(1200-0.4*(Hidden!C$51))))),IF(Hidden!C$51=\"\",\"\",IF((BK25*'Product Selector'!G$3+BL25)>500,IF((1600*'Product Selector'!G$3+BL25)<500,500,(1600*'Product Selector'!G$3+BL25)),BK25*'Product Selector'!G$3+BL25))))","v":800},2000,{"$f":"IF(Hidden!B$52=1,MAX(Hidden!G$49,BM25),BM25)","v":0},0]
["2TLA022301R1100","Orion1-4-14-180-E  Transmitter+ Receiver","Finger","Orion1-4-14-180-E",1800,192,33,14,1806.3,null,0.2,7,"2TLA022315R0100","M12-C02PT2T","2TLA022315R0300","M12-C02PT62RM","2TLA022315R0200","M12-C02PT6RB",null,null,"2TLA020056R0000","M12-C61","2TLA020056R1000","M12-C101","2TLA020056R1400","M12-C201","2TLA020056R7200","M12-C65","2TLA020056R7300","M12-C105","2TLA020056R7500","M12-C205",{"$nulls":6},"2TLA020056R0000","M12-C61","2TLA020056R1000","M12-C101","2TLA020056R1400","M12-C201","None"," - ","2TLA022312R0400","Orion Stand 190","None"," - ","1 pc 2TLA022311R0500\n 1 pc 2TLA022310R0900\n1 pc 2TLA022312R0400","Orion1 Mirror 190\nJSM Orion11\nOrion Stand 190","2TLA022310R5000","Orion Laser","2TLA022310R5200","Orion TP-14","2TLA022310R0000","JSM Orion01","None"," - ","Muting, blanking",{"$f":"IF('Product Selector'!G$3=\"\",\"\",IF(Hidden!B$53=2,IF(Hidden!C$51=\"\",\"\",(1600*'Product Selector'!G$3+IF((1200-0.4*Hidden!C$51)<850,850,(1200-0.4*(Hidden!C$51))))),IF(Hidden!C$51=\"\",\"\",IF((BK26*'Product Selector'!G$3+BL26)>500,IF((1600*'Product Selector'!G$3+BL26)<500,500,(1600*'Product Selector'!G$3+BL26)),BK26*'Product Selector'!G$3+BL26))))","v":800},2000,{"$f":"IF(Hidden!B$52=1,MAX(Hidden!G$49,BM26),BM26)","v":0},0]
["2TLA022302R0000","Orion1-4-30-015-B  Transmitter+ Receiver","Hand","Orion1-4-30-015-B",150,8,9,30,233.3,153.30000000000001,0.2,19,{"$nulls":8},"2TLA020056R0000","M12-C61","2TLA020056R1000","M12-C101","2TLA020056R1400","M12-C201","2TLA020056R3000","M12-C63","2TLA020056R4000","M12-C103","2TLA020056R4100","M12-C203",{"$nulls":12},"2TLA022313R0000","Orion WET-015","2TLA022312R0000","Orion Stand 060","2TLA022313R5000",{"$f":"IF(AW27=\"None\",\" - \",VLOOKUP(AW27,$A$4:$D$143,4,FALSE))","v":"Orion Shield-015"},"1 pc 2TLA022311R0100\n 1 pc 2TLA022310R0900\n1 pc 2TLA022312R0000","Orion1 Mirror 060\nJSM Orion11\nOrion Stand 060","2TLA022310R5000","Orion Laser","2TLA022310R5300","Orion TP-30","2TLA022310R0000","JSM Orion01","2TLA022310R0100","JSM Orion03","No",{"$f":"IF('Product Selector'!G$3=\"\",\"\",IF(Hidden!B$53=2,IF(Hidden!C$51=\"\",\"\",(1600*'Product Selector'!G$3+IF((1200-0.4*Hidden!C$51)<850,850,(1200-0.4*(Hidden!C$51))))),IF(Hidden!C$51=\"\",\"\",IF((BK27*'Product Selector'!G$3+BL27)>500,IF((1600*'Product Selector'!G$3+BL27)<500,500,(1600*'Product Selector'!G$3+BL27)),BK27*'Product Selector'!G$3+BL27))))","v":928},2000,{"$f":"IF(Hidden!B$52=1,MAX(Hidden!G$49,BM27),BM27)","v":128},128]
["2TLA022302R0100","Orion1-4-30-030-B  Transmitter+ Receiver","Hand","Orion1-4-30-030-B",300,16,11,30,383.2,303.2,0.2,19,{"$nulls":8},"2TLA020056R0000","M12-C61","2TLA020056R1000","M12-C101","2TLA020056R1400","M12-C201","2TLA020056R3000","M12-C63","2TLA020056R4000","M12-C103","2TLA020056R4100","M12-C203",{"$nulls":12},"2TLA022313R0100","Orion WET-030","2TLA022312R0000","Orion Stand 060","2TLA022313R5100",{"$f":"IF(AW28=\"None\",\" - \",VLOOKUP(AW28,$A$4:$D$143,4,FALSE))","v":"Orion Shield-030"},"1 pc 2TLA022311R0100\n 1 pc 2TLA022310R0900\n1 pc 2TLA022312R0000","Orion1 Mirror 060\nJSM Orion11\nOrion Stand 060","2TLA022310R5000","Orion Laser","2TLA022310R5300","Orion TP-30","2TLA022310R0000","JSM Orion01","2TLA022310R0100","JSM Orion03","No",{"$f":"IF('Product Selector'!G$3=\"\",\"\",IF(Hidden!B$53=2,IF(Hidden!C$51=\"\",\"\",(1600*'Product Selector'!G$3+IF((1200-0.4*Hidden!C$51)<850,850,(1200-0.4*(Hidden!C$51))))),IF(Hidden!C$51=\"\",\"\",IF((BK28*'Product Selector'!G$3+BL28)>500,IF((1600*'Product Selector'!G$3+BL28)<500,500,(1600*'Product Selector'!G$3+BL28)),BK28*'Product Selector'!G$3+BL28))))","v":928},2000,{"$f":"IF(Hidden!B$52=1,MAX(Hidden!G$49,BM28),BM28)","v":128},128]
["2TLA022302R0200","Orion1-4-30-045-B  Transmitter+ Receiver","Hand","Orion1-4-30-045-B",450,24,13,30,533.20000000000005,453.3,0.2,19,{"$nulls":8},"2TLA020056R0000","M12-C61","2TLA020056R1000","M12-C101","2TLA020056R1400","M12-C201","2TLA020056R3000","M12-C63","2TLA020056R4000","M12-C103","2TLA020056R4100","M12-C203",{"$nulls":12},"2TLA022313R0200","Orion WET-045","2TLA022312R0000","Orion Stand 060","2TLA022313R5200","Orion Shield-045","1 pc 2TLA022311R0100\n 1 pc 2TLA022310R0900\n1 pc 2TLA022312R0000","Orion1 Mirror 060\nJSM Orion11\nOrion Stand 060","2TLA022310R5000","Orion Laser","2TLA022310R5300","Orion TP-30","2TLA022310R0000","JSM Orion01","2TLA022310R0100","JSM Orion03","No",{"$f":"IF('Product Selector'!G$3=\"\",\"\",IF(Hidden!B$53=2,IF(Hidden!C$51=\"\",\"\",(1600*'Product Selector'!G$3+IF((1200-0.4*Hidden!C$51)<850,850,(1200-0.4*(Hidden!C$51))))),IF(Hidden!C$51=\"\",\"\",IF((BK29*'Product Selector'!G$3+BL29)>500,IF((1600*'Product Selector'!G$3+BL29)<500,500,(1600*'Product Selector'!G$3+BL29)),BK29*'Product Selector'!G$3+BL29))))","v":928},2000,{"$f":"IF(Hidden!B$52=1,MAX(Hidden!G$49,BM29),BM29)","v":128},128]
["2TLA022302R0300","Orion1-4-30-060-B  Transmitter+ Receiver","Hand","Orion1-4-30-060-B",600,32,14,30,683.2,603.20000000000005,0.2,19,{"$nulls":8},"2TLA020056R0000","M12-C61","2TLA020056R1000","M12-C101","2TLA020056R1400","M12-C201","2TLA020056R3000","M12-C63","2TLA020056R4000","M12-C103","2TLA020056R4100","M12-C203",{"$nulls":12},"2TLA022313R0300","Orion WET-060","2TLA022312R0100","Orion Stand 100","2TLA022313R5300","Orion Shield-060","1 pc 2TLA022311R0200\n 1 pc 2TLA022310R0900\n1 pc 2TLA022312R0100","Orion1 Mirror 090\nJSM Orion11\nOrion Stand 100","2TLA022310R5000","Orion Laser","2TLA022310R5300","Orion TP-30","2TLA022310R0000","JSM Orion01","2TLA022310R0100","JSM Orion03","No",{"$f":"IF('Product Selector'!G$3=\"\",\"\",IF(Hidden!B$53=2,IF(Hidden!C$51=\"\",\"\",(1600*'Product Selector'!G$3+IF((1200-0.4*Hidden!C$51)<850,850,(1200-0.4*(Hidden!C$51))))),IF(Hidden!C$51=\"\",\"\",IF((BK30*'Product Selector'!G$3+BL30)>500,IF((1600*'Product Selector'!G$3+BL30)<500,500,(1600*'Product Selector'!G$3+BL30)),BK30*'Product Selector'!G$3+BL30))))","v":928},2000,{"$f":"IF(Hidden!B$52=1,MAX(Hidden!G$49,BM30),BM30)","v":128},128]
["2TLA022302R0400","Orion1-4-30-075-B  Transmitter+ Receiver","Hand","Orion1-4-30-075-B",750,40,16,30,833.2,753.3,0.2,19,{"$nulls":8},"2TLA020056R0000","M12-C61","2TLA020056R1000","M12-C101","2TLA020056R1400","M12-C201","2TLA020056R3000","M12-C63","2TLA020056R4000","M12-C103","2TLA020056R4100","M12-C203",{"$nulls":12},"2TLA022313R0400","Orion WET-075","2TLA022312R0100","Orion Stand 100","2TLA022313R5400","Orion Shield-075","1 pc 2TLA022311R0200\n 1 pc 2TLA022310R0900\n1 pc 2TLA022312R0100","Orion1 Mirror 090\nJSM Orion11\nOrion Stand 100","2TLA022310R5000","Orion Laser","2TLA022310R5300","Orion TP-30","2TLA022310R0000","JSM Orion01","2TLA022310R0100","JSM Orion03","No",{"$f":"IF('Product Selector'!G$3=\"\",\"\",IF(Hidden!B$53=2,IF(Hidden!C$51=\"\",\"\",(1600*'Product Selector'!G$3+IF((1200-0.4*Hidden!C$51)<850,850,(1200-0.4*(Hidden!C$51))))),IF(Hidden!C$51=\"\",\"\",IF((BK31*'Product Selector'!G$3+BL31)>500,IF((1600*'Product Selector'!G$3+BL31)<500,500,(1600*'Product Selector'!G$3+BL31)),BK31*'Product Selector'!G$3+BL31))))","v":928},2000,{"$f":"IF(Hidden!B$52=1,MAX(Hidden!G$49,BM31),BM31)","v":128},128]
["2TLA022302R0500","Orion1-4-30-090-B  Transmitter+ Receiver","Hand","Orion1-4-30-090-B",900,48,18,30,983.2,903.2,0.2,19,{"$nulls":8},"2TLA020056R0000","M12-C61","2TLA020056R1000","M12-C101","2TLA020056R1400","M12-C201","2TLA020056R3000","M12-C63","2TLA020056R4000","M12-C103","2TLA020056R4100","M12-C203",{"$nulls":12},"2TLA022313R0500","Orion WET-090","2TLA022312R0200","Orion Stand 120","2TLA022313R5500","Orion Shield-090","1 pc 2TLA022311R0300\n 1 pc 2TLA022310R0900\n1 pc 2TLA022312R0200","Orion1 Mirror 120\nJSM Orion11\nOrion Stand 120","2TLA022310R5000","Orion Laser","2TLA022310R5300","Orion TP-30","2TLA022310R0000","JSM Orion01","2TLA022310R0100","JSM Orion03","No",{"$f":"IF('Product Selector'!G$3=\"\",\"\",IF(Hidden!B$53=2,IF(Hidden!C$51=\"\",\"\",(1600*'Product Selector'!G$3+IF((1200-0.4*Hidden!C$51)<850,850,(1200-0.4*(Hidden!C$51))))),IF(Hidden!C$51=\"\",\"\",IF((BK32*'Product Selector'!G$3+BL32)>500,IF((1600*'Product Selector'!G$3+BL32)<500,500,(1600*'Product Selector'!G$3+BL32)),BK32*'Product Selector'!G$3+BL32))))","v":928},2000,{"$f":"IF(Hidden!B$52=1,MAX(Hidden!G$49,BM32),BM32)","v":128},128]
["2TLA022302R0600","Orion1-4-30-105-B  Transmitter+ Receiver","Hand","Orion1-4-30-105-B",1050,56,19,30,1133.2,1053.2,0.2,19,{"$nulls":8},"2TLA020056R0000","M12-C61","2TLA020056R1000","M12-C101","2TLA020056R1400","M12-C201","2TLA020056R3000","M12-C63","2TLA020056R4000","M12-C103","2TLA020056R4100","M12-C203",{"$nulls":12},"2TLA022313R0600","Orion WET-105","2TLA022312R0200","Orion Stand 120","2TLA022313R5600","Orion Shield-105","1 pc 2TLA022311R0300\n 1 pc 2TLA022310R0900\n1 pc 2TLA022312R0200","Orion1 Mirror 120\nJSM Orion11\nOrion Stand 120","2TLA022310R5000","Orion Laser","2TLA022310R5300","Orion TP-30","2TLA022310R0000","JSM Orion01","2TLA022310R0100","JSM Orion03","No",{"$f":"IF('Product Selector'!G$3=\"\",\"\",IF(Hidden!B$53=2,IF(Hidden!C$51=\"\",\"\",(1600*'Product Selector'!G$3+IF((1200-0.4*Hidden!C$51)<850,850,(1200-0.4*(Hidden!C$51))))),IF(Hidden!C$51=\"\",\"\",IF((BK33*'Product Selector'!G$3+BL33)>500,IF((1600*'Product Selector'!G$3+BL33)<500,500,(1600*'Product Selector'!G$3+BL33)),BK33*'Product Selector'!G$3+BL33))))","v":928},2000,{"$f":"IF(Hidden!B$52=1,MAX(Hidden!G$49,BM33),BM33)","v":128},128]
["2TLA022302R0700","Orion1-4-30-120-B  Transmitter+ Receiver","Hand","Orion1-4-30-120-B",1200,64,21,30,1283.3,1203.3,0.2,19,{"$nulls":8},"2TLA020056R0000","M12-C61","2TLA020056R1000","M12-C101","2TLA020056R1400","M12-C201","2TLA020056R3000","M12-C63","2TLA020056R4000","M12-C103","2TLA020056R4100","M12-C203",{"$nulls":12},"2TLA022313R0700","Orion WET-120","2TLA022312R0300","Orion Stand 165","2TLA022313R5700","Orion Shield-120","1 pc 2TLA022311R0400\n 1 pc 2TLA022310R0900\n1 pc 2TLA022312R0300","Orion1 Mirror 165\nJSM Orion11\nOrion Stand 165","2TLA022310R5000","Orion Laser","2TLA022310R5300","Orion TP-30","2TLA022310R0000","JSM Orion01","2TLA022310R0100","JSM Orion03","No",{"$f":"IF('Product Selector'!G$3=\"\",\"\",IF(Hidden!B$53=2,IF(Hidden!C$51=\"\",\"\",(1600*'Product Selector'!G$3+IF((1200-0.4*Hidden!C$51)<850,850,(1200-0.4*(Hidden!C$51))))),IF(Hidden!C$51=\"\",\"\",IF((BK34*'Product Selector'!G$3+BL34)>500,IF((1600*'Product Selector'!G$3+BL34)<500,500,(1600*'Product Selector'!G$3+BL34)),BK34*'Product Selector'!G$3+BL34))))","v":928},2000,{"$f":"IF(Hidden!B$52=1,MAX(Hidden!G$49,BM34),BM34)","v":128},128]
["2TLA022302R0800","Orion1-4-30-135-B  Transmitter+ Receiver","Hand","Orion1-4-30-135-B",1350,72,23,30,1433.2,1353.2,0.2,19,{"$nulls":8},"2TLA020056R0000","M12-C61","2TLA020056R1000","M12-C101","2TLA020056R1400","M12-C201","2TLA020056R3000","M12-C63","2TLA020056R4000","M12-C103","2TLA020056R4100","M12-C203",{"$nulls":12},"2TLA022313R0800","Orion WET-135","2TLA022312R0300","Orion Stand 165","2TLA022313R5800","Orion Shield-135","1 pc 2TLA022311R0400\n 1 pc 2TLA022310R0900\n1 pc 2TLA022312R0300","Orion1 Mirror 165\nJSM Orion11\nOrion Stand 165","2TLA022310R5000","Orion Laser","2TLA022310R5300","Orion TP-30","2TLA022310R0000","JSM Orion01","2TLA022310R0100","JSM Orion03","No",{"$f":"IF('Product Selector'!G$3=\"\",\"\",IF(Hidden!B$53=2,IF(Hidden!C$51=\"\",\"\",(1600*'Product Selector'!G$3+IF((1200-0.4*Hidden!C$51)<850,850,(1200-0.4*(Hidden!C$51))))),IF(Hidden!C$51=\"\",\"\",IF((BK35*'Product Selector'!G$3+BL35)>500,IF((1600*'Product Selector'!G$3+BL35)<500,500,(1600*'Product Selector'!G$3+BL35)),BK35*'Product Selector'!G$3+BL35))))","v":928},2000,{"$f":"IF(Hidden!B$52=1,MAX(Hidden!G$49,BM35),BM35)","v":128},128]
["2TLA022302R0900","Orion1-4-30-150-B  Transmitter+ Receiver","Hand","Orion1-4-30-150-B",1500,80,25,30,1583.3,1503.3,0.2,19,{"$nulls":8},"2TLA020056R0000","M12-C61","2TLA020056R1000","M12-C101","2TLA020056R1400","M12-C201","2TLA020056R3000","M12-C63","2TLA020056R4000","M12-C103","2TLA020056R4100","M12-C203",{"$nulls":12},"2TLA022313R0900","Orion WET-150","2TLA022312R0300",{"$f":"IF(AU36=\"None\",\" - \",VLOOKUP(AU36,$A$4:$D$143,4,FALSE))","v":"Orion Stand 165"},"2TLA022313R5900","Orion Shield-150","1 pc 2TLA022311R0400\n 1 pc 2TLA022310R0900\n1 pc 2TLA022312R0300","Orion1 Mirror 165\nJSM Orion11\nOrion Stand 165","2TLA022310R5000","Orion Laser","2TLA022310R5300","Orion TP-30","2TLA022310R0000","JSM Orion01","2TLA022310R0100","JSM Orion03","No",{"$f":"IF('Product Selector'!G$3=\"\",\"\",IF(Hidden!B$53=2,IF(Hidden!C$51=\"\",\"\",(1600*'Product Selector'!G$3+IF((1200-0.4*Hidden!C$51)<850,850,(1200-0.4*(Hidden!C$51))))),IF(Hidden!C$51=\"\",\"\",IF((BK36*'Product Selector'!G$3+BL36)>500,IF((1600*'Product Selector'!G$3+BL36)<500,500,(1600*'Product Selector'!G$3+BL36)),BK36*'Product Selector'!G$3+BL36))))","v":928},2000,{"$f":"IF(Hidden!B$52=1,MAX(Hidden!G$49,BM36),BM36)","v":128},128]
["2TLA022302R1000","Orion1-4-30-165-B  Transmitter+ Receiver","Hand","Orion1-4-30-165-B",1650,88,26,30,1733.3,1653.3,0.2,19,{"$nulls":8},"2TLA020056R0000","M12-C61","2TLA020056R1000","M12-C101","2TLA020056R1400","M12-C201","2TLA020056R3000","M12-C63","2TLA020056R4000","M12-C103","2TLA020056R4100","M12-C203",{"$nulls":12},"2TLA022313R1000","Orion WET-165","2TLA022312R0400","Orion Stand 190","2TLA022313R6000","Orion Shield-165","1 pc 2TLA022311R0500\n 1 pc 2TLA022310R0900\n1 pc 2TLA022312R0400","Orion1 Mirror 190\nJSM Orion11\nOrion Stand 190","2TLA022310R5000","Orion Laser","2TLA022310R5300","Orion TP-30","2TLA022310R0000","JSM Orion01","2TLA022310R0100","JSM Orion03","No",{"$f":"IF('Product Selector'!G$3=\"\",\"\",IF(Hidden!B$53=2,IF(Hidden!C$51=\"\",\"\",(1600*'Product Selector'!G$3+IF((1200-0.4*Hidden!C$51)<850,850,(1200-0.4*(Hidden!C$51))))),IF(Hidden!C$51=\"\",\"\",IF((BK37*'Product Selector'!G$3+BL37)>500,IF((1600*'Product Selector'!G$3+BL37)<500,500,(1600*'Product Selector'!G$3+BL37)),BK37*'Product Selector'!G$3+BL37))))","v":928},2000,{"$f":"IF(Hidden!B$52=1,MAX(Hidden!G$49,BM37),BM37)","v":128},128]
["2TLA022302R1100","Orion1-4-30-180-B  Transmitter+ Receiver","Hand","Orion1-4-30-180-B",1800,96,28,30,1883.3,1803.3,0.2,19,{"$nulls":8},"2TLA020056R0000","M12-C61","2TLA020056R1000","M12-C101","2TLA020056R1400","M12-C201","2TLA020056R3000","M12-C63","2TLA020056R4000","M12-C103","2TLA020056R4100","M12-C203",{"$nulls":12},"2TLA022313R1100","Orion WET-180","2TLA022312R0400","Orion Stand 190","2TLA022313R6100","Orion Shield-180","1 pc 2TLA022311R0500\n 1 pc 2TLA022310R0900\n1 pc 2TLA022312R0400","Orion1 Mirror 190\nJSM Orion11\nOrion Stand 190","2TLA022310R5000","Orion Laser","2TLA022310R5300","Orion TP-30","2TLA022310R0000","JSM Orion01","2TLA022310R0100","JSM Orion03","No",{"$f":"IF('Product Selector'!G$3=\"\",\"\",IF(Hidden!B$53=2,IF(Hidden!C$51=\"\",\"\",(1600*'Product Selector'!G$3+IF((1200-0.4*Hidden!C$51)<850,850,(1200-0.4*(Hidden!C$51))))),IF(Hidden!C$51=\"\",\"\",IF((BK38*'Product Selector'!G$3+BL38)>500,IF((1600*'Product Selector'!G$3+BL38)<500,500,(1600*'Product Selector'!G$3+BL38)),BK38*'Product Selector'!G$3+BL38))))","v":928},2000,{"$f":"IF(Hidden!B$52=1,MAX(Hidden!G$49,BM38),BM38)","v":128},128]
["2TLA022303R0100","Orion1-4-30-030-E  Transmitter+ Receiver","Hand","Orion1-4-30-030-E",300,16,13,30,306.3,null,0.2,20,"2TLA022315R0100","M12-C02PT2T","2TLA022315R0300","M12-C02PT62RM","2TLA022315R0200",{"$f":"IF(Q39=\"None\",\" - \",VLOOKUP(Q39,$A$4:$D$143,4,FALSE))","v":"M12-C02PT6RB"},null,null,"2TLA020056R0000","M12-C61","2TLA020056R1000","M12-C101","2TLA020056R1400","M12-C201","2TLA020056R7200","M12-C65","2TLA020056R7300","M12-C105","2TLA020056R7500","M12-C205",{"$nulls":6},"2TLA020056R0000","M12-C61","2TLA020056R1000","M12-C101","2TLA020056R1400","M12-C201","None"," - ","2TLA022312R0000","Orion Stand 060","None"," - ","1 pc 2TLA022311R0100\n 1 pc 2TLA022310R0900\n1 pc 2TLA022312R0000","Orion1 Mirror 060\nJSM Orion11\nOrion Stand 060","2TLA022310R5000","Orion Laser","2TLA022310R5300","Orion TP-30","2TLA022310R0000","JSM Orion01","None"," - ","Muting, blanking",{"$f":"IF('Product Selector'!G$3=\"\",\"\",IF(Hidden!B$53=2,IF(Hidden!C$51=\"\",\"\",(1600*'Product Selector'!G$3+IF((1200-0.4*Hidden!C$51)<850,850,(1200-0.4*(Hidden!C$51))))),IF(Hidden!C$51=\"\",\"\",IF((BK39*'Product Selector'!G$3+BL39)>500,IF((1600*'Product Selector'!G$3+BL39)<500,500,(1600*'Product Selector'!G$3+BL39)),BK39*'Product Selector'!G$3+BL39))))","v":928},2000,{"$f":"IF(Hidden!B$52=1,MAX(Hidden!G$49,BM39),BM39)","v":128},128]
["2TLA022303R0200","Orion1-4-30-045-E  Transmitter+ Receiver","Hand","Orion1-4-30-045-E",450,24,14,30,456.3,null,0.2,20,"2TLA022315R0100","M12-C02PT2T","2TLA022315R0300","M12-C02PT62RM","2TLA022315R0200","M12-C02PT6RB",null,null,"2TLA020056R0000","M12-C61","2TLA020056R1000","M12-C101","2TLA020056R1400","M12-C201","2TLA020056R7200","M12-C65","2TLA020056R7300","M12-C105","2TLA020056R7500","M12-C205",{"$nulls":6},"2TLA020056R0000","M12-C61","2TLA020056R1000","M12-C101","2TLA020056R1400","M12-C201","None"," - ","2TLA022312R0000","Orion Stand 060","None"," - ","1 pc 2TLA022311R0100\n 1 pc 2TLA022310R0900\n1 pc 2TLA022312R0000","Orion1 Mirror 060\nJSM Orion11\nOrion Stand 060","2TLA022310R5000","Orion Laser","2TLA022310R5300","Orion TP-30","2TLA022310R0000","JSM Orion01","None"," - ","Muting, blanking",{"$f":"IF('Product Selector'!G$3=\"\",\"\",IF(Hidden!B$53=2,IF(Hidden!C$51=\"\",\"\",(1600*'Product Selector'!G$3+IF((1200-0.4*Hidden!C$51)<850,850,(1200-0.4*(Hidden!C$51))))),IF(Hidden!C$51=\"\",\"\",IF((BK40*'Product Selector'!G$3+BL40)>500,IF((1600*'Product Selector'!G$3+BL40)<500,500,(1600*'Product Selector'!G$3+BL40)),BK40*'Product Selector'!G$3+BL40))))","v":928},2000,{"$f":"IF(Hidden!B$52=1,MAX(Hidden!G$49,BM40),BM40)","v":128},128]
["2TLA022303R0300","Orion1-4-30-060-E  Transmitter+ Receiver","Hand","Orion1-4-30-060-E",600,32,15,30,606.29999999999995,null,0.2,20,"2TLA022315R0100","M12-C02PT2T","2TLA022315R0300","M12-C02PT62RM","2TLA022315R0200","M12-C02PT6RB",null,null,"2TLA020056R0000","M12-C61","2TLA020056R1000","M12-C101","2TLA020056R1400","M12-C201","2TLA020056R7200","M12-C65","2TLA020056R7300","M12-C105","2TLA020056R7500","M12-C205",{"$nulls":6},"2TLA020056R0000","M12-C61","2TLA020056R1000","M12-C101","2TLA020056R1400","M12-C201","None"," - ","2TLA022312R0100","Orion Stand 100","None"," - ","1 pc 2TLA022311R0200\n 1 pc 2TLA022310R0900\n1 pc 2TLA022312R0100","Orion1 Mirror 090\nJSM Orion11\nOrion Stand 100","2TLA022310R5000","Orion Laser","2TLA022310R5300","Orion TP-30","2TLA022310R0000","JSM Orion01","None"," - ","Muting, blanking",{"$f":"IF('Product Selector'!G$3=\"\",\"\",IF(Hidden!B$53=2,IF(Hidden!C$51=\"\",\"\",(1600*'Product Selector'!G$3+IF((1200-0.4*Hidden!C$51)<850,850,(1200-0.4*(Hidden!C$51))))),IF(Hidden!C$51=\"\",\"\",IF((BK41*'Product Selector'!G$3+BL41)>500,IF((1600*'Product Selector'!G$3+BL41)<500,500,(1600*'Product Selector'!G$3+BL41)),BK41*'Product Selector'!G$3+BL41))))","v":928},2000,{"$f":"IF(Hidden!B$52=1,MAX(Hidden!G$49,BM41),BM41)","v":128},128]
["2TLA022303R0400","Orion1-4-30-075-E  Transmitter+ Receiver","Hand","Orion1-4-30-075-E",750,40,16,30,756.3,null,0.2,20,"2TLA022315R0100","M12-C02PT2T","2TLA022315R0300","M12-C02PT62RM","2TLA022315R0200","M12-C02PT6RB",null,null,"2TLA020056R0000","M12-C61","2TLA020056R1000","M12-C101","2TLA020056R1400","M12-C201","2TLA020056R7200","M12-C65","2TLA020056R7300","M12-C105","2TLA020056R7500","M12-C205",{"$nulls":6},"2TLA020056R0000","M12-C61","2TLA020056R1000","M12-C101","2TLA020056R1400","M12-C201","None"," - ","2TLA022312R0100","Orion Stand 100","None"," - ","1 pc 2TLA022311R0200\n 1 pc 2TLA022310R0900\n1 pc 2TLA022312R0100","Orion1 Mirror 090\nJSM Orion11\nOrion Stand 100","2TLA022310R5000","Orion Laser","2TLA022310R5300","Orion TP-30","2TLA022310R0000","JSM Orion01","None"," - ","Muting, blanking",{"$f":"IF('Product Selector'!G$3=\"\",\"\",IF(Hidden!B$53=2,IF(Hidden!C$51=\"\",\"\",(1600*'Product Selector'!G$3+IF((1200-0.4*Hidden!C$51)<850,850,(1200-0.4*(Hidden!C$51))))),IF(Hidden!C$51=\"\",\"\",IF((BK42*'Product Selector'!G$3+BL42)>500,IF((1600*'Product Selector'!G$3+BL42)<500,500,(1600*'Product Selector'!G$3+BL42)),BK42*'Product Selector'!G$3+BL42))))","v":928},2000,{"$f":"IF(Hidden!B$52=1,MAX(Hidden!G$49,BM42),BM42)","v":128},128]
["2TLA022303R0500","Orion1-4-30-090-E  Transmitter+ Receiver","Hand","Orion1-4-30-090-E",900,48,17,30,906.3,null,0.2,20,"2TLA022315R0100","M12-C02PT2T","2TLA022315R0300","M12-C02PT62RM","2TLA022315R0200","M12-C02PT6RB",null,null,"2TLA020056R0000","M12-C61","2TLA020056R1000","M12-C101","2TLA020056R1400","M12-C201","2TLA020056R7200","M12-C65","2TLA020056R7300","M12-C105","2TLA020056R7500","M12-C205",{"$nulls":6},"2TLA020056R0000","M12-C61","2TLA020056R1000","M12-C101","2TLA020056R1400","M12-C201","None"," - ","2TLA022312R0200","Orion Stand 120","None"," - ","1 pc 2TLA022311R0300\n 1 pc 2TLA022310R0900\n1 pc 2TLA022312R0200","Orion1 Mirror 120\nJSM Orion11\nOrion Stand 120","2TLA022310R5000","Orion Laser","2TLA022310R5300","Orion TP-30","2TLA022310R0000","JSM Orion01","None"," - ","Muting, blanking",{"$f":"IF('Product Selector'!G$3=\"\",\"\",IF(Hidden!B$53=2,IF(Hidden!C$51=\"\",\"\",(1600*'Product Selector'!G$3+IF((1200-0.4*Hidden!C$51)<850,850,(1200-0.4*(Hidden!C$51))))),IF(Hidden!C$51=\"\",\"\",IF((BK43*'Product Selector'!G$3+BL43)>500,IF((1600*'Product Selector'!G$3+BL43)<500,500,(1600*'Product Selector'!G$3+BL43)),BK43*'Product Selector'!G$3+BL43))))","v":928},2000,{"$f":"IF(Hidden!B$52=1,MAX(Hidden!G$49,BM43),BM43)","v":128},128]
["2TLA022303R0600","Orion1-4-30-105-E  Transmitter+ Receiver","Hand","Orion1-4-30-105-E",1050,56,18,30,1056.3,null,0.2,20,"2TLA022315R0100","M12-C02PT2T","2TLA022315R0300","M12-C02PT62RM","2TLA022315R0200","M12-C02PT6RB",null,null,"2TLA020056R0000","M12-C61","2TLA020056R1000","M12-C101","2TLA020056R1400","M12-C201","2TLA020056R7200","M12-C65","2TLA020056R7300","M12-C105","2TLA020056R7500","M12-C205",{"$nulls":6},"2TLA020056R0000","M12-C61","2TLA020056R1000","M12-C101","2TLA020056R1400","M12-C201","None"," - ","2TLA022312R0200","Orion Stand 120","None"," - ","1 pc 2TLA022311R0300\n 1 pc 2TLA022310R0900\n1 pc 2TLA022312R0200","Orion1 Mirror 120\nJSM Orion11\nOrion Stand 120","2TLA022310R5000","Orion Laser","2TLA022310R5300","Orion TP-30","2TLA022310R0000","JSM Orion01","None"," - ","Muting, blanking",{"$f":"IF('Product Selector'!G$3=\"\",\"\",IF(Hidden!B$53=2,IF(Hidden!C$51=\"\",\"\",(1600*'Product Selector'!G$3+IF((1200-0.4*Hidden!C$51)<850,850,(1200-0.4*(Hidden!C$51))))),IF(Hidden!C$51=\"\",\"\",IF((BK44*'Product Selector'!G$3+BL44)>500,IF((1600*'Product Selector'!G$3+BL44)<500,500,(1600*'Product Selector'!G$3+BL44)),BK44*'Product Selector'!G$3+BL44))))","v":928},2000,{"$f":"IF(Hidden!B$52=1,MAX(Hidden!G$49,BM44),BM44)","v":128},128]
["2TLA022303R0700","Orion1-4-30-120-E  Transmitter+ Receiver","Hand","Orion1-4-30-120-E",1200,64,19,30,1206.3,null,0.2,20,"2TLA022315R0100","M12-C02PT2T","2TLA022315R0300","M12-C02PT62RM","2TLA022315R0200","M12-C02PT6RB",null,null,"2TLA020056R0000","M12-C61","2TLA020056R1000","M12-C101","2TLA020056R1400","M12-C201","2TLA020056R7200","M12-C65","2TLA020056R7300","M12-C105","2TLA020056R7500","M12-C205",{"$nulls":6},"2TLA020056R0000","M12-C61","2TLA020056R1000","M12-C101","2TLA020056R1400","M12-C201","None"," - ","2TLA022312R0300","Orion Stand 165","None"," - ","1 pc 2TLA022311R0400\n 1 pc 2TLA022310R0900\n1 pc 2TLA022312R0300","Orion1 Mirror 165\nJSM Orion11\nOrion Stand 165","2TLA022310R5000","Orion Laser","2TLA022310R5300","Orion TP-30","2TLA022310R0000","JSM Orion01","None"," - ","Muting, blanking",{"$f":"IF('Product Selector'!G$3=\"\",\"\",IF(Hidden!B$53=2,IF(Hidden!C$51=\"\",\"\",(1600*'Product Selector'!G$3+IF((1200-0.4*Hidden!C$51)<850,850,(1200-0.4*(Hidden!C$51))))),IF(Hidden!C$51=\"\",\"\",IF((BK45*'Product Selector'!G$3+BL45)>500,IF((1600*'Product Selector'!G$3+BL45)<500,500,(1600*'Product Selector'!G$3+BL45)),BK45*'Product Selector'!G$3+BL45))))","v":928},2000,{"$f":"IF(Hidden!B$52=1,MAX(Hidden!G$49,BM45),BM45)","v":128},128]
["2TLA022303R0800","Orion1-4-30-135-E  Transmitter+ Receiver","Hand","Orion1-4-30-135-E",1350,72,19,30,1356.3,null,0.2,20,"2TLA022315R0100","M12-C02PT2T","2TLA022315R0300","M12-C02PT62RM","2TLA022315R0200","M12-C02PT6RB",null,null,"2TLA020056R0000","M12-C61","2TLA020056R1000","M12-C101","2TLA020056R1400","M12-C201","2TLA020056R7200","M12-C65","2TLA020056R7300","M12-C105","2TLA020056R7500","M12-C205",{"$nulls":6},"2TLA020056R0000","M12-C61","2TLA020056R1000","M12-C101","2TLA020056R1400","M12-C201","None"," - ","2TLA022312R0300","Orion Stand 165","None"," - ","1 pc 2TLA022311R0400\n 1 pc 2TLA022310R0900\n1 pc 2TLA022312R0300","Orion1 Mirror 165\nJSM Orion11\nOrion Stand 165","2TLA022310R5000","Orion Laser","2TLA022310R5300","Orion TP-30","2TLA022310R0000","JSM Orion01","None"," - ","Muting, blanking",{"$f":"IF('Product Selector'!G$3=\"\",\"\",IF(Hidden!B$53=2,IF(Hidden!C$51=\"\",\"\",(1600*'Product Selector'!G$3+IF((1200-0.4*Hidden!C$51)<850,850,(1200-0.4*(Hidden!C$51))))),IF(Hidden!C$51=\"\",\"\",IF((BK46*'Product Selector'!G$3+BL46)>500,IF((1600*'Product Selector'!G$3+BL46)<500,500,(1600*'Product Selector'!G$3+BL46)),BK46*'Product Selector'!G$3+BL46))))","v":928},2000,{"$f":"IF(Hidden!B$52=1,MAX(Hidden!G$49,BM46),BM46)","v":128},128]
["2TLA022303R0900","Orion1-4-30-150-E  Transmitter+ Receiver","Hand","Orion1-4-30-150-E",1500,80,20,30,1506.3,null,0.2,20,"2TLA022315R0100","M12-C02PT2T","2TLA022315R0300","M12-C02PT62RM","2TLA022315R0200","M12-C02PT6RB",null,null,"2TLA020056R0000","M12-C61","2TLA020056R1000","M12-C101","2TLA020056R1400","M12-C201","2TLA020056R7200","M12-C65","2TLA020056R7300","M12-C105","2TLA020056R7500","M12-C205",{"$nulls":6},"2TLA020056R0000","M12-C61","2TLA020056R1000","M12-C101","2TLA020056R1400","M12-C201","None"," - ","2TLA022312R0300","Orion Stand 165","None"," - ","1 pc 2TLA022311R0400\n 1 pc 2TLA022310R0900\n1 pc 2TLA022312R0300","Orion1 Mirror 165\nJSM Orion11\nOrion Stand 165","2TLA022310R5000","Orion Laser","2TLA022310R5300","Orion TP-30","2TLA022310R0000","JSM Orion01","None"," - ","Muting, blanking",{"$f":"IF('Product Selector'!G$3=\"\",\"\",IF(Hidden!B$53=2,IF(Hidden!C$51=\"\",\"\",(1600*'Product Selector'!G$3+IF((1200-0.4*Hidden!C$51)<850,850,(1200-0.4*(Hidden!C$51))))),IF(Hidden!C$51=\"\",\"\",IF((BK47*'Product Selector'!G$3+BL47)>500,IF((1600*'Product Selector'!G$3+BL47)<500,500,(1600*'Product Selector'!G$3+BL47)),BK47*'Product Selector'!G$3+BL47))))","v":928},2000,{"$f":"IF(Hidden!B$52=1,MAX(Hidden!G$49,BM47),BM47)","v":128},128]
["2TLA022303R1000","Orion1-4-30-165-E  Transmitter+ Receiver","Hand","Orion1-4-30-165-E",1650,88,21,30,1656.3,null,0.2,20,"2TLA022315R0100","M12-C02PT2T","2TLA022315R0300","M12-C02PT62RM","2TLA022315R0200","M12-C02PT6RB",null,null,"2TLA020056R0000","M12-C61","2TLA020056R1000","M12-C101","2TLA020056R1400","M12-C201","2TLA020056R7200","M12-C65","2TLA020056R7300","M12-C105","2TLA020056R7500","M12-C205",{"$nulls":6},"2TLA020056R0000","M12-C61","2TLA020056R1000","M12-C101","2TLA020056R1400","M12-C201","None"," - ","2TLA022312R0400","Orion Stand 190","None"," - ","1 pc 2TLA022311R0500\n 1 pc 2TLA022310R0900\n1 pc 2TLA022312R0400","Orion1 Mirror 190\nJSM Orion11\nOrion Stand 190","2TLA022310R5000","Orion Laser","2TLA022310R5300","Orion TP-30","2TLA022310R0000","JSM Orion01","None"," - ","Muting, blanking",{"$f":"IF('Product Selector'!G$3=\"\",\"\",IF(Hidden!B$53=2,IF(Hidden!C$51=\"\",\"\",(1600*'Product Selector'!G$3+IF((1200-0.4*Hidden!C$51)<850,850,(1200-0.4*(Hidden!C$51))))),IF(Hidden!C$51=\"\",\"\",IF((BK48*'Product Selector'!G$3+BL48)>500,IF((1600*'Product Selector'!G$3+BL48)<500,500,(1600*'Product Selector'!G$3+BL48)),BK48*'Product Selector'!G$3+BL48))))","v":928},2000,{"$f":"IF(Hidden!B$52=1,MAX(Hidden!G$49,BM48),BM48)","v":128},128]
["2TLA022303R1100","Orion1-4-30-180-E  Transmitter+ Receiver","Hand","Orion1-4-30-180-E",1800,96,22,30,1806.3,null,0.2,20,"2TLA022315R0100","M12-C02PT2T","2TLA022315R0300","M12-C02PT62RM","2TLA022315R0200","M12-C02PT6RB",null,null,"2TLA020056R0000","M12-C61","2TLA020056R1000","M12-C101","2TLA020056R1400","M12-C201","2TLA020056R7200","M12-C65","2TLA020056R7300","M12-C105","2TLA020056R7500","M12-C205",{"$nulls":6},"2TLA020056R0000","M12-C61","2TLA020056R1000","M12-C101","2TLA020056R1400","M12-C201","None"," - ","2TLA022312R0400","Orion Stand 190","None"," - ","1 pc 2TLA022311R0500\n 1 pc 2TLA022310R0900\n1 pc 2TLA022312R0400","Orion1 Mirror 190\nJSM Orion11\nOrion Stand 190","2TLA022310R5000","Orion Laser","2TLA022310R5300","Orion TP-30","2TLA022310R0000","JSM Orion01","None"," - ","Muting, blanking",{"$f":"IF('Product Selector'!G$3=\"\",\"\",IF(Hidden!B$53=2,IF(Hidden!C$51=\"\",\"\",(1600*'Product Selector'!G$3+IF((1200-0.4*Hidden!C$51)<850,850,(1200-0.4*(Hidden!C$51))))),IF(Hidden!C$51=\"\",\"\",IF((BK49*'Product Selector'!G$3+BL49)>500,IF((1600*'Product Selector'!G$3+BL49)<500,500,(1600*'Product Selector'!G$3+BL49)),BK49*'Product Selector'!G$3+BL49))))","v":928},2000,{"$f":"IF(Hidden!B$52=1,MAX(Hidden!G$49,BM49),BM49)","v":128},128]
["2TLA022304R0000","Orion2-4-K2-050-B Transmitter+ Receiver ","Body","Orion2-4-K2-050-B ",500,2,14,515,664,null,0.5,50,{"$nulls":8},"2TLA020056R0000","M12-C61","2TLA020056R1000","M12-C101","2TLA020056R1400","M12-C201","2TLA020056R3000","M12-C63","2TLA020056R4000","M12-C103","2TLA020056R4100","M12-C203",{"$nulls":12},"2TLA022313R3000","Orion WET-K050","2TLA022312R0100","Orion Stand 100","2TLA022313R8000","Orion Shield-K050","2TLA022312R1000",{"$f":"IF(AY50=\"None\",\" - \",VLOOKUP(AY50,$A$4:$D$143,4,FALSE))","v":"Orion Mirror K050"},"2TLA022310R5000","Orion Laser",null,null,"2TLA022310R0000","JSM Orion01","2TLA022310R0200","JSM Orion04","No",{"$f":"IF('Product Selector'!G$3=\"\",\"\",IF(Hidden!B$53=2,IF(Hidden!C$51=\"\",\"\",(1600*'Product Selector'!G$3+IF((1200-0.4*Hidden!C$51)<850,850,(1200-0.4*(Hidden!C$51))))),IF(Hidden!C$51=\"\",\"\",(BK50*'Product Selector'!G$3+BL50))))","v":1650},1600,{"$f":"IF(Hidden!B$52=1,MAX(Hidden!G$49,BM50),BM50)","v":850},850]
["2TLA022304R0100","Orion2-4-K3-080-B Transmitter+ Receiver ","Body","Orion2-4-K3-080-B ",800,3,14,415,964,null,0.5,50,{"$nulls":8},"2TLA020056R0000","M12-C61","2TLA020056R1000","M12-C101","2TLA020056R1400","M12-C201","2TLA020056R3000","M12-C63","2TLA020056R4000","M12-C103","2TLA020056R4100","M12-C203",{"$nulls":12},"2TLA022313R3100","Orion WET-K080","2TLA022312R0200","Orion Stand 120","2TLA022313R8100","Orion Shield-K080","2TLA022312R1100","Orion Mirror K080","2TLA022310R5000","Orion Laser",null,null,"2TLA022310R0000","JSM Orion01","2TLA022310R0200","JSM Orion04","No",{"$f":"IF('Product Selector'!G$3=\"\",\"\",IF(Hidden!B$53=2,IF(Hidden!C$51=\"\",\"\",(1600*'Product Selector'!G$3+IF((1200-0.4*Hidden!C$51)<850,850,(1200-0.4*(Hidden!C$51))))),IF(Hidden!C$51=\"\",\"\",BK51*'Product Selector'!G$3+BL51)))","v":1650},1600,{"$f":"IF(Hidden!B$52=1,MAX(Hidden!G$49,BM51),BM51)","v":850},850]
["2TLA022304R0200","Orion2-4-K4-090-B Transmitter+ Receiver ","Body","Orion2-4-K4-090-B ",900,4,16,315,1064,null,0.5,50,{"$nulls":8},"2TLA020056R0000","M12-C61","2TLA020056R1000","M12-C101","2TLA020056R1400","M12-C201","2TLA020056R3000","M12-C63","2TLA020056R4000","M12-C103","2TLA020056R4100","M12-C203",{"$nulls":12},"2TLA022313R3200","Orion WET-K090","2TLA022312R0300","Orion Stand 165","2TLA022313R8200","Orion Shield-K090","2TLA022312R1200","Orion Mirror K090","2TLA022310R5000","Orion Laser",null,null,"2TLA022310R0000","JSM Orion01","2TLA022310R0200","JSM Orion04","No",{"$f":"IF('Product Selector'!G$3=\"\",\"\",IF(Hidden!B$53=2,IF(Hidden!C$51=\"\",\"\",(1600*'Product Selector'!G$3+IF((1200-0.4*Hidden!C$51)<850,850,(1200-0.4*(Hidden!C$51))))),IF(Hidden!C$51=\"\",\"\",BK52*'Product Selector'!G$3+BL52)))","v":1650},1600,{"$f":"IF(Hidden!B$52=1,MAX(Hidden!G$49,BM52),BM52)","v":850},850]
["2TLA022304R0300","Orion2-4-K4-120-B Transmitter+ Receiver ","Body","Orion2-4-K4-120-B ",1200,4,16,415,1364,null,0.5,50,{"$nulls":8},"2TLA020056R0000","M12-C61","2TLA020056R1000","M12-C101","2TLA020056R1400","M12-C201","2TLA020056R3000","M12-C63","2TLA020056R4000","M12-C103","2TLA020056R4100","M12-C203",{"$nulls":12},"2TLA022313R3300","Orion WET-K120","2TLA022312R0300","Orion Stand 165","2TLA022313R8300","Orion Shield-K120","2TLA022312R1300","Orion Mirror K120","2TLA022310R5000","Orion Laser",null,null,"2TLA022310R0000","JSM Orion01","2TLA022310R0200","JSM Orion04","No",{"$f":"IF('Product Selector'!G$3=\"\",\"\",IF(Hidden!B$53=2,IF(Hidden!C$51=\"\",\"\",(1600*'Product Selector'!G$3+IF((1200-0.4*Hidden!C$51)<850,850,(1200-0.4*(Hidden!C$51))))),IF(Hidden!C$51=\"\",\"\",BK53*'Product Selector'!G$3+BL53)))","v":1650},1600,{"$f":"IF(Hidden!B$52=1,MAX(Hidden!G$49,BM53),BM53)","v":850},850]
["2TLA022305R0000","Orion2-4-K2-050-E Transmitter+ Receiver ","Body","Orion2-4-K2-050-E ",500,2,14,515,664,null,0.5,50,{"$nulls":8},"2TLA020056R0000","M12-C61","2TLA020056R1000","M12-C101","2TLA020056R1400","M12-C201","2TLA020056R3000","M12-C63","2TLA020056R4000","M12-C103","2TLA020056R4100","M12-C203",{"$nulls":12},"2TLA022313R3000","Orion WET-K050","2TLA022312R0100","Orion Stand 100","2TLA022313R8000","Orion Shield-K050","2TLA022312R1000","Orion Mirror K050","2TLA022310R5000","Orion Laser",null,null,"2TLA022310R0000","JSM Orion01","2TLA022310R0200","JSM Orion04","Muting",{"$f":"IF('Product Selector'!G$3=\"\",\"\",IF(Hidden!B$53=2,IF(Hidden!C$51=\"\",\"\",(1600*'Product Selector'!G$3+IF((1200-0.4*Hidden!C$51)<850,850,(1200-0.4*(Hidden!C$51))))),IF(Hidden!C$51=\"\",\"\",BK54*'Product Selector'!G$3+BL54)))","v":1650},1600,{"$f":"IF(Hidden!B$52=1,MAX(Hidden!G$49,BM54),BM54)","v":850},850]
["2TLA022305R0100","Orion2-4-K3-080-E Transmitter+ Receiver ","Body","Orion2-4-K3-080-E ",800,3,14,415,964,null,0.5,50,{"$nulls":8},"2TLA020056R0000","M12-C61","2TLA020056R1000","M12-C101","2TLA020056R1400","M12-C201","2TLA020056R3000","M12-C63","2TLA020056R4000","M12-C103","2TLA020056R4100","M12-C203",{"$nulls":12},"2TLA022313R3100","Orion WET-K080","2TLA022312R0200","Orion Stand 120","2TLA022313R8100","Orion Shield-K080","2TLA022312R1100","Orion Mirror K080","2TLA022310R5000","Orion Laser",null,null,"2TLA022310R0000","JSM Orion01","2TLA022310R0200","JSM Orion04","Muting",{"$f":"IF('Product Selector'!G$3=\"\",\"\",IF(Hidden!B$53=2,IF(Hidden!C$51=\"\",\"\",(1600*'Product Selector'!G$3+IF((1200-0.4*Hidden!C$51)<850,850,(1200-0.4*(Hidden!C$51))))),IF(Hidden!C$51=\"\",\"\",BK55*'Product Selector'!G$3+BL55)))","v":1650},1600,{"$f":"IF(Hidden!B$52=1,MAX(Hidden!G$49,BM55),BM55)","v":850},850]
["2TLA022305R0200","Orion2-4-K4-090-E Transmitter+ Receiver ","Body","Orion2-4-K4-090-E ",900,4,16,315,1064,null,0.5,50,{"$nulls":8},"2TLA020056R0000","M12-C61","2TLA020056R1000","M12-C101","2TLA020056R1400","M12-C201","2TLA020056R3000","M12-C63","2TLA020056R4000","M12-C103","2TLA020056R4100","M12-C203",{"$nulls":12},"2TLA022313R3200","Orion WET-K090","2TLA022312R0300","Orion Stand 165","2TLA022313R8200","Orion Shield-K090","2TLA022312R1200","Orion Mirror K090","2TLA022310R5000","Orion Laser",null,null,"2TLA022310R0000","JSM Orion01","2TLA022310R0200","JSM Orion04","Muting",{"$f":"IF('Product Selector'!G$3=\"\",\"\",IF(Hidden!B$53=2,IF(Hidden!C$51=\"\",\"\",(1600*'Product Selector'!G$3+IF((1200-0.4*Hidden!C$51)<850,850,(1200-0.4*(Hidden!C$51))))),IF(Hidden!C$51=\"\",\"\",BK56*'Product Selector'!G$3+BL56)))","v":1650},1600,{"$f":"IF(Hidden!B$52=1,MAX(Hidden!G$49,BM56),BM56)","v":850},850]
["2TLA022305R0300","Orion2-4-K4-120-E  Transmitter+ Receiver","Body","Orion2-4-K4-120-E",1200,4,16,415,1364,null,0.5,50,{"$nulls":8},"2TLA020056R0000","M12-C61","2TLA020056R1000","M12-C101","2TLA020056R1400","M12-C201","2TLA020056R3000","M12-C63","2TLA020056R4000","M12-C103","2TLA020056R4100","M12-C203",{"$nulls":12},"2TLA022313R3300","Orion WET-K120","2TLA022312R0300","Orion Stand 165","2TLA022313R8300","Orion Shield-K120","2TLA022312R1300","Orion Mirror K120","2TLA022310R5000","Orion Laser",null,null,"2TLA022310R0000","JSM Orion01","2TLA022310R0200","JSM Orion04","Muting",{"$f":"IF('Product Selector'!G$3=\"\",\"\",IF(Hidden!B$53=2,IF(Hidden!C$51=\"\",\"\",(1600*'Product Selector'!G$3+IF((1200-0.4*Hidden!C$51)<850,850,(1200-0.4*(Hidden!C$51))))),IF(Hidden!C$51=\"\",\"\",BK57*'Product Selector'!G$3+BL57)))","v":1650},1600,{"$f":"IF(Hidden!B$52=1,MAX(Hidden!G$49,BM57),BM57)","v":850},850]
["2TLA022306R0000","Orion3-4-K1C-050-B - Active unit","Body","Orion3-4-K1C-050-B",500,2,11,519.75,606.35,null,0.5,8,{"$nulls":6},"2TLA022306R1000",{"$f":"IF(S58=\"None\",\" - \",VLOOKUP(S58,$A$4:$D$143,4,FALSE))","v":"Orion3-4-M1C-050"},{"$nulls":12},"2TLA020056R3000","M12-C63","2TLA020056R4000","M12-C103","2TLA020056R4100","M12-C203",{"$nulls":6},"None"," - ","2TLA022312R0100","Orion Stand 100","None"," - ","2TLA022312R1000","Orion Mirror K050","2TLA022310R5000","Orion Laser",null,null,"2TLA022310R1000","JSM Orion02","2TLA022310R0300","JSM Orion05","No",{"$f":"IF('Product Selector'!G$3=\"\",\"\",IF(Hidden!B$53=2,IF(Hidden!C$51=\"\",\"\",(1600*'Product Selector'!G$3+IF((1200-0.4*Hidden!C$51)<850,850,(1200-0.4*(Hidden!C$51))))),IF(Hidden!C$51=\"\",\"\",BK58*'Product Selector'!G$3+BL58)))","v":1650},1600,{"$f":"IF(Hidden!B$52=1,MAX(Hidden!G$49,BM58),BM58)","v":850},850]
["2TLA022306R0100","Orion3-4-K2C-080-B - Active unit","Body","Orion3-4-K2C-080-B",800,3,12,399.75,906.35,null,0.5,8,{"$nulls":6},"2TLA022306R1100",{"$f":"IF(S59=\"None\",\" - \",VLOOKUP(S59,$A$4:$D$143,4,FALSE))","v":"Orion3-4-M2C-080"},{"$nulls":12},"2TLA020056R3000","M12-C63","2TLA020056R4000","M12-C103","2TLA020056R4100","M12-C203",{"$nulls":6},"None"," - ","2TLA022312R0200","Orion Stand 120","None"," - ","2TLA022312R1100","Orion Mirror K080","2TLA022310R5000","Orion Laser",null,null,"2TLA022310R1000","JSM Orion02","2TLA022310R0300","JSM Orion05","No",{"$f":"IF('Product Selector'!G$3=\"\",\"\",IF(Hidden!B$53=2,IF(Hidden!C$51=\"\",\"\",(1600*'Product Selector'!G$3+IF((1200-0.4*Hidden!C$51)<850,850,(1200-0.4*(Hidden!C$51))))),IF(Hidden!C$51=\"\",\"\",BK59*'Product Selector'!G$3+BL59)))","v":1650},1600,{"$f":"IF(Hidden!B$52=1,MAX(Hidden!G$49,BM59),BM59)","v":850},850]
["2TLA022306R0200","Orion3-4-K2C-090-B - Active unit","Body","Orion3-4-K2C-090-B",900,4,12,319.75,1006.35,null,0.5,6.5,{"$nulls":6},"2TLA022306R1300",{"$f":"IF(S60=\"None\",\" - \",VLOOKUP(S60,$A$4:$D$143,4,FALSE))","v":"Orion3-4-M2C-090"},{"$nulls":12},"2TLA020056R3000","M12-C63","2TLA020056R4000","M12-C103","2TLA020056R4100","M12-C203",{"$nulls":6},"None"," - ","2TLA022312R0300","Orion Stand 165","None"," - ","2TLA022312R1200","Orion Mirror K090","2TLA022310R5000","Orion Laser",null,null,"2TLA022310R1000","JSM Orion02","2TLA022310R0300","JSM Orion05","No",{"$f":"IF('Product Selector'!G$3=\"\",\"\",IF(Hidden!B$53=2,IF(Hidden!C$51=\"\",\"\",(1600*'Product Selector'!G$3+IF((1200-0.4*Hidden!C$51)<850,850,(1200-0.4*(Hidden!C$51))))),IF(Hidden!C$51=\"\",\"\",BK60*'Product Selector'!G$3+BL60)))","v":1650},1600,{"$f":"IF(Hidden!B$52=1,MAX(Hidden!G$49,BM60),BM60)","v":850},850]
["2TLA022306R0300","Orion3-4-K2C-120-B - Active unit","Body","Orion3-4-K2C-120-B",1200,4,12,419.75,1306.3499999999999,null,0.5,8,{"$nulls":6},"2TLA022306R1400",{"$f":"IF(S61=\"None\",\" - \",VLOOKUP(S61,$A$4:$D$143,4,FALSE))","v":"Orion3-4-M2C-120"},{"$nulls":12},"2TLA020056R3000","M12-C63","2TLA020056R4000","M12-C103","2TLA020056R4100","M12-C203",{"$nulls":6},"None"," - ","2TLA022312R0300","Orion Stand 165","None"," - ","2TLA022312R1300","Orion Mirror K120","2TLA022310R5000","Orion Laser",null,null,"2TLA022310R1000","JSM Orion02","2TLA022310R0300","JSM Orion05","No",{"$f":"IF('Product Selector'!G$3=\"\",\"\",IF(Hidden!B$53=2,IF(Hidden!C$51=\"\",\"\",(1600*'Product Selector'!G$3+IF((1200-0.4*Hidden!C$51)<850,850,(1200-0.4*(Hidden!C$51))))),IF(Hidden!C$51=\"\",\"\",BK61*'Product Selector'!G$3+BL61)))","v":1650},1600,{"$f":"IF(Hidden!B$52=1,MAX(Hidden!G$49,BM61),BM61)","v":850},850]
["2TLA022306R1000","Orion3-4-M1C-050 - Passive unit","Accessory","Orion3-4-M1C-050",{"$nulls":4},580.5,{"$nulls":37},"2TLA022312R0100","Orion Stand 100",{"$nulls":8},"2TLA022310R1000","JSM Orion02","2TLA022310R0300","JSM Orion05",null,{"$f":"IF('Product Selector'!G$3=\"\",\"\",IF(Hidden!B$53=2,IF(Hidden!C$51=\"\",\"\",(1600*'Product Selector'!G$3+IF((1200-0.4*Hidden!C$51)<850,850,(1200-0.4*(Hidden!C$51))))),IF(Hidden!C$51=\"\",\"\",BK62*'Product Selector'!G$3+BL62)))","v":1650},1600,{"$f":"IF(Hidden!B$52=1,MAX(Hidden!G$49,BM62),BM62)","v":850},850]
["2TLA022306R1100","Orion3-4-M2C-080 - Passive unit","Accessory","Orion3-4-M2C-080",{"$nulls":4},880.5,{"$nulls":37},"2TLA022312R0200","Orion Stand 120",{"$nulls":8},"2TLA022310R1000","JSM Orion02","2TLA022310R0300","JSM Orion05",null,{"$f":"IF('Product Selector'!G$3=\"\",\"\",IF(Hidden!B$53=2,IF(Hidden!C$51=\"\",\"\",(1600*'Product Selector'!G$3+IF((1200-0.4*Hidden!C$51)<850,850,(1200-0.4*(Hidden!C$51))))),IF(Hidden!C$51=\"\",\"\",BK63*'Product Selector'!G$3+BL63)))","v":1650},1600,{"$f":"IF(Hidden!B$52=1,MAX(Hidden!G$49,BM63),BM63)","v":850},850]
["2TLA022306R1300","Orion3-4-M2C-090 - Passive unit","Accessory","Orion3-4-M2C-090",{"$nulls":4},980.5,{"$nulls":37},"2TLA022312R0300","Orion Stand 165",{"$nulls":8},"2TLA022310R1000","JSM Orion02","2TLA022310R0300","JSM Orion05",null,{"$f":"IF('Product Selector'!G$3=\"\",\"\",IF(Hidden!B$53=2,IF(Hidden!C$51=\"\",\"\",(1600*'Product Selector'!G$3+IF((1200-0.4*Hidden!C$51)<850,850,(1200-0.4*(Hidden!C$51))))),IF(Hidden!C$51=\"\",\"\",BK64*'Product Selector'!G$3+BL64)))","v":1650},1600,{"$f":"IF(Hidden!B$52=1,MAX(Hidden!G$49,BM64),BM64)","v":850},850]
["2TLA022306R1400","Orion3-4-M2C-120 - Passive unit","Accessory","Orion3-4-M2C-120",{"$nulls":4},1280.5,{"$nulls":37},"2TLA022312R0300","Orion Stand 165",{"$nulls":8},"2TLA022310R1000","JSM Orion02","2TLA022310R0300","JSM Orion05",null,{"$f":"IF('Product Selector'!G$3=\"\",\"\",IF(Hidden!B$53=2,IF(Hidden!C$51=\"\",\"\",(1600*'Product Selector'!G$3+IF((1200-0.4*Hidden!C$51)<850,850,(1200-0.4*(Hidden!C$51))))),IF(Hidden!C$51=\"\",\"\",BK65*'Product Selector'!G$3+BL65)))","v":1650},1600,{"$f":"IF(Hidden!B$52=1,MAX(Hidden!G$49,BM65),BM65)","v":850},850]
["2TLA022307R0000","Orion3-4-K1C-050-E - Active unit","Body","Orion3-4-K1C-050-E",500,2,11,519.75,606.35,null,0.5,8,{"$nulls":6},"2TLA022306R1000",{"$f":"IF(S66=\"None\",\" - \",VLOOKUP(S66,$A$4:$D$143,4,FALSE))","v":"Orion3-4-M1C-050"},{"$nulls":12},"2TLA020056R3000","M12-C63","2TLA020056R4000","M12-C103","2TLA020056R4100","M12-C203",{"$nulls":6},"None",{"$f":"IF(AS66=\"None\",\" - \",VLOOKUP(AS66,$A$4:$D$143,4,FALSE))","v":" - "},"2TLA022312R0100","Orion Stand 100","None",{"$f":"IF(AW66=\"None\",\" - \",VLOOKUP(AW66,$A$4:$D$143,4,FALSE))","v":" - "},"2TLA022312R1000",{"$f":"IF(AY66=\"None\",\" - \",VLOOKUP(AY66,$A$4:$D$143,4,FALSE))","v":"Orion Mirror K050"},"2TLA022310R5000",{"$f":"IF(BA66=\"None\",\" - \",VLOOKUP(BA66,$A$4:$D$143,4,FALSE))","v":"Orion Laser"},null,null,"2TLA022310R1000","JSM Orion02","2TLA022310R0300","JSM Orion05","Muting",{"$f":"IF('Product Selector'!G$3=\"\",\"\",IF(Hidden!B$53=2,IF(Hidden!C$51=\"\",\"\",(1600*'Product Selector'!G$3+IF((1200-0.4*Hidden!C$51)<850,850,(1200-0.4*(Hidden!C$51))))),IF(Hidden!C$51=\"\",\"\",BK66*'Product Selector'!G$3+BL66)))","v":1650},1600,{"$f":"IF(Hidden!B$52=1,MAX(Hidden!G$49,BM66),BM66)","v":850},850]
["2TLA022307R0100","Orion3-4-K2C-080-E - Active unit","Body","Orion3-4-K2C-080-E",800,3,12,399.75,906.35,null,0.5,8,{"$nulls":6},"2TLA022306R1100",{"$f":"IF(S67=\"None\",\" - \",VLOOKUP(S67,$A$4:$D$143,4,FALSE))","v":"Orion3-4-M2C-080"},{"$nulls":12},"2TLA020056R3000","M12-C63","2TLA020056R4000","M12-C103","2TLA020056R4100","M12-C203",{"$nulls":6},"None",{"$f":"IF(AS67=\"None\",\" - \",VLOOKUP(AS67,$A$4:$D$143,4,FALSE))","v":" - "},"2TLA022312R0200","Orion Stand 120","None",{"$f":"IF(AW67=\"None\",\" - \",VLOOKUP(AW67,$A$4:$D$143,4,FALSE))","v":" - "},"2TLA022312R1100",{"$f":"IF(AY67=\"None\",\" - \",VLOOKUP(AY67,$A$4:$D$143,4,FALSE))","v":"Orion Mirror K080"},"2TLA022310R5000",{"$f":"IF(BA67=\"None\",\" - \",VLOOKUP(BA67,$A$4:$D$143,4,FALSE))","v":"Orion Laser"},null,null,"2TLA022310R1000","JSM Orion02","2TLA022310R0300","JSM Orion05","Muting",{"$f":"IF('Product Selector'!G$3=\"\",\"\",IF(Hidden!B$53=2,IF(Hidden!C$51=\"\",\"\",(1600*'Product Selector'!G$3+IF((1200-0.4*Hidden!C$51)<850,850,(1200-0.4*(Hidden!C$51))))),IF(Hidden!C$51=\"\",\"\",BK67*'Product Selector'!G$3+BL67)))","v":1650},1600,{"$f":"IF(Hidden!B$52=1,MAX(Hidden!G$49,BM67),BM67)","v":850},850]
["2TLA022307R0200","Orion3-4-K2C-090-E - Active unit","Body","Orion3-4-K2C-090-E",900,4,12,319.75,1006.35,null,0.5,6.5,{"$nulls":6},"2TLA022306R1300",{"$f":"IF(S68=\"None\",\" - \",VLOOKUP(S68,$A$4:$D$143,4,FALSE))","v":"Orion3-4-M2C-090"},{"$nulls":12},"2TLA020056R3000","M12-C63","2TLA020056R4000","M12-C103","2TLA020056R4100","M12-C203",{"$nulls":6},"None",{"$f":"IF(AS68=\"None\",\" - \",VLOOKUP(AS68,$A$4:$D$143,4,FALSE))","v":" - "},"2TLA022312R0300",{"$f":"IF(AU68=\"None\",\" - \",VLOOKUP(AU68,$A$4:$D$143,4,FALSE))","v":"Orion Stand 165"},"None",{"$f":"IF(AW68=\"None\",\" - \",VLOOKUP(AW68,$A$4:$D$143,4,FALSE))","v":" - "},"2TLA022312R1200",{"$f":"IF(AY68=\"None\",\" - \",VLOOKUP(AY68,$A$4:$D$143,4,FALSE))","v":"Orion Mirror K090"},"2TLA022310R5000",{"$f":"IF(BA68=\"None\",\" - \",VLOOKUP(BA68,$A$4:$D$143,4,FALSE))","v":"Orion Laser"},null,null,"2TLA022310R1000","JSM Orion02","2TLA022310R0300","JSM Orion05","Muting",{"$f":"IF('Product Selector'!G$3=\"\",\"\",IF(Hidden!B$53=2,IF(Hidden!C$51=\"\",\"\",(1600*'Product Selector'!G$3+IF((1200-0.4*Hidden!C$51)<850,850,(1200-0.4*(Hidden!C$51))))),IF(Hidden!C$51=\"\",\"\",BK68*'Product Selector'!G$3+BL68)))","v":1650},1600,{"$f":"IF(Hidden!B$52=1,MAX(Hidden!G$49,BM68),BM68)","v":850},850]
["2TLA022307R0300","Orion3-4-K2C-120-E - Active unit","Body","Orion3-4-K2C-120-E",1200,4,12,419.75,1306.3499999999999,null,0.5,8,{"$nulls":6},"2TLA022306R1400",{"$f":"IF(S69=\"None\",\" - \",VLOOKUP(S69,$A$4:$D$143,4,FALSE))","v":"Orion3-4-M2C-120"},{"$nulls":12},"2TLA020056R3000","M12-C63","2TLA020056R4000","M12-C103","2TLA020056R4100","M12-C203",{"$nulls":6},"None",{"$f":"IF(AS69=\"None\",\" - \",VLOOKUP(AS69,$A$4:$D$143,4,FALSE))","v":" - "},"2TLA022312R0300","Orion Stand 165","None",{"$f":"IF(AW69=\"None\",\" - \",VLOOKUP(AW69,$A$4:$D$143,4,FALSE))","v":" - "},"2TLA022312R1300",{"$f":"IF(AY69=\"None\",\" - \",VLOOKUP(AY69,$A$4:$D$143,4,FALSE))","v":"Orion Mirror K120"},"2TLA022310R5000",{"$f":"IF(BA69=\"None\",\" - \",VLOOKUP(BA69,$A$4:$D$143,4,FALSE))","v":"Orion Laser"},null,null,"2TLA022310R1000",{"$f":"IF(BE69=\"None\",\" - \",VLOOKUP(BE69,$A$4:$D$143,4,FALSE))","v":"JSM Orion02"},"2TLA022310R0300",{"$f":"IF(BG69=\"None\",\" - \",VLOOKUP(BG69,$A$4:$D$143,4,FALSE))","v":"JSM Orion05"},"Muting",{"$f":"IF('Product Selector'!G$3=\"\",\"\",IF(Hidden!B$53=2,IF(Hidden!C$51=\"\",\"\",(1600*'Product Selector'!G$3+IF((1200-0.4*Hidden!C$51)<850,850,(1200-0.4*(Hidden!C$51))))),IF(Hidden!C$51=\"\",\"\",BK69*'Product Selector'!G$3+BL69)))","v":1650},{"$f":"IF(OR(C69=\"finger\",C69=\"hand\"),2000,1600)","v":1600},{"$f":"IF(Hidden!B$52=1,MAX(Hidden!G$49,BM69),BM69)","v":850},{"$f":"IF(C69=\"finger\",0,IF(C69=\"Hand\",128,850))","v":850}]
["2TLA022310R0000","JSM Orion01 - 4 std brackets for O1&O2","Accessory","JSM Orion01",{"$nulls":57},{"$f":"IF('Product Selector'!G$3=\"\",\"\",IF(Hidden!B$53=2,IF(Hidden!C$51=\"\",\"\",(1600*'Product Selector'!G$3+IF((1200-0.4*Hidden!C$51)<850,850,(1200-0.4*(Hidden!C$51))))),IF(Hidden!C$51=\"\",\"\",BK70*'Product Selector'!G$3+BL70)))","v":1650},1600,{"$f":"IF(Hidden!B$52=1,MAX(Hidden!G$49,BM70),BM70)","v":850},850]
["2TLA022310R0100","JSM Orion03 -4 rotation brackets for O1B","Accessory","JSM Orion03",{"$nulls":57},{"$f":"IF('Product Selector'!G$3=\"\",\"\",IF(Hidden!B$53=2,IF(Hidden!C$51=\"\",\"\",(1600*'Product Selector'!G$3+IF((1200-0.4*Hidden!C$51)<850,850,(1200-0.4*(Hidden!C$51))))),IF(Hidden!C$51=\"\",\"\",BK71*'Product Selector'!G$3+BL71)))","v":1650},1600,{"$f":"IF(Hidden!B$52=1,MAX(Hidden!G$49,BM71),BM71)","v":850},850]
["2TLA022310R0200","JSM Orion04 - 4 rotation brackets for O2","Accessory","JSM Orion04",{"$nulls":57},{"$f":"IF('Product Selector'!G$3=\"\",\"\",IF(Hidden!B$53=2,IF(Hidden!C$51=\"\",\"\",(1600*'Product Selector'!G$3+IF((1200-0.4*Hidden!C$51)<850,850,(1200-0.4*(Hidden!C$51))))),IF(Hidden!C$51=\"\",\"\",BK72*'Product Selector'!G$3+BL72)))","v":1650},1600,{"$f":"IF(Hidden!B$52=1,MAX(Hidden!G$49,BM72),BM72)","v":850},850]
["2TLA022310R0300","JSM Orion05 - 4 rotation brackets for O3","Accessory","JSM Orion05",{"$nulls":57},{"$f":"IF('Product Selector'!G$3=\"\",\"\",IF(Hidden!B$53=2,IF(Hidden!C$51=\"\",\"\",(1600*'Product Selector'!G$3+IF((1200-0.4*Hidden!C$51)<850,850,(1200-0.4*(Hidden!C$51))))),IF(Hidden!C$51=\"\",\"\",BK73*'Product Selector'!G$3+BL73)))","v":1650},1600,{"$f":"IF(Hidden!B$52=1,MAX(Hidden!G$49,BM73),BM73)","v":850},850]
["2TLA022310R0400","JSM Orion06 - Kit for O1&O2 in Stand (4)","Accessory","JSM Orion06",{"$nulls":57},{"$f":"IF('Product Selector'!G$3=\"\",\"\",IF(Hidden!B$53=2,IF(Hidden!C$51=\"\",\"\",(1600*'Product Selector'!G$3+IF((1200-0.4*Hidden!C$51)<850,850,(1200-0.4*(Hidden!C$51))))),IF(Hidden!C$51=\"\",\"\",BK74*'Product Selector'!G$3+BL74)))","v":1650},1600,{"$f":"IF(Hidden!B$52=1,MAX(Hidden!G$49,BM74),BM74)","v":850},850]
["2TLA022310R0500","JSM Orion07 - Kit for O1&O2 in Stand (6)","Accessory","JSM Orion07",{"$nulls":57},{"$f":"IF('Product Selector'!G$3=\"\",\"\",IF(Hidden!B$53=2,IF(Hidden!C$51=\"\",\"\",(1600*'Product Selector'!G$3+IF((1200-0.4*Hidden!C$51)<850,850,(1200-0.4*(Hidden!C$51))))),IF(Hidden!C$51=\"\",\"\",BK75*'Product Selector'!G$3+BL75)))","v":1650},1600,{"$f":"IF(Hidden!B$52=1,MAX(Hidden!G$49,BM75),BM75)","v":850},850]
["2TLA022310R0600","JSM Orion08 - Kit for O3 in Stand (4)","Accessory","JSM Orion08",{"$nulls":57},{"$f":"IF('Product Selector'!G$3=\"\",\"\",IF(Hidden!B$53=2,IF(Hidden!C$51=\"\",\"\",(1600*'Product Selector'!G$3+IF((1200-0.4*Hidden!C$51)<850,850,(1200-0.4*(Hidden!C$51))))),IF(Hidden!C$51=\"\",\"\",BK76*'Product Selector'!G$3+BL76)))","v":1650},1600,{"$f":"IF(Hidden!B$52=1,MAX(Hidden!G$49,BM76),BM76)","v":850},850]
["2TLA022310R0700","JSM Orion09 - Kit for O3 in Stand (6)","Accessory","JSM Orion09",{"$nulls":57},{"$f":"IF('Product Selector'!G$3=\"\",\"\",IF(Hidden!B$53=2,IF(Hidden!C$51=\"\",\"\",(1600*'Product Selector'!G$3+IF((1200-0.4*Hidden!C$51)<850,850,(1200-0.4*(Hidden!C$51))))),IF(Hidden!C$51=\"\",\"\",BK77*'Product Selector'!G$3+BL77)))","v":1650},1600,{"$f":"IF(Hidden!B$52=1,MAX(Hidden!G$49,BM77),BM77)","v":850},850]
["2TLA022310R0800","JSM Orion10 - Kit Orion1 Mirror  on wall","Accessory","JSM Orion10",{"$nulls":57},{"$f":"IF('Product Selector'!G$3=\"\",\"\",IF(Hidden!B$53=2,IF(Hidden!C$51=\"\",\"\",(1600*'Product Selector'!G$3+IF((1200-0.4*Hidden!C$51)<850,850,(1200-0.4*(Hidden!C$51))))),IF(Hidden!C$51=\"\",\"\",BK78*'Product Selector'!G$3+BL78)))","v":1650},1600,{"$f":"IF(Hidden!B$52=1,MAX(Hidden!G$49,BM78),BM78)","v":850},850]
["2TLA022310R0900","JSM Orion11 - Kit Orion1 Mirror in Stand","Accessory","JSM Orion11",{"$nulls":57},{"$f":"IF('Product Selector'!G$3=\"\",\"\",IF(Hidden!B$53=2,IF(Hidden!C$51=\"\",\"\",(1600*'Product Selector'!G$3+IF((1200-0.4*Hidden!C$51)<850,850,(1200-0.4*(Hidden!C$51))))),IF(Hidden!C$51=\"\",\"\",BK79*'Product Selector'!G$3+BL79)))","v":1650},1600,{"$f":"IF(Hidden!B$52=1,MAX(Hidden!G$49,BM79),BM79)","v":850},850]
["2TLA022310R1000","JSM Orion02 -4 standard brackets  for O3","Accessory","JSM Orion02",{"$nulls":57},{"$f":"IF('Product Selector'!G$3=\"\",\"\",IF(Hidden!B$53=2,IF(Hidden!C$51=\"\",\"\",(1600*'Product Selector'!G$3+IF((1200-0.4*Hidden!C$51)<850,850,(1200-0.4*(Hidden!C$51))))),IF(Hidden!C$51=\"\",\"\",BK80*'Product Selector'!G$3+BL80)))","v":1650},1600,{"$f":"IF(Hidden!B$52=1,MAX(Hidden!G$49,BM80),BM80)","v":850},850]
["2TLA022310R5000","Orion Laser pointer","Accessory","Orion Laser",{"$nulls":57},{"$f":"IF('Product Selector'!G$3=\"\",\"\",IF(Hidden!B$53=2,IF(Hidden!C$51=\"\",\"\",(1600*'Product Selector'!G$3+IF((1200-0.4*Hidden!C$51)<850,850,(1200-0.4*(Hidden!C$51))))),IF(Hidden!C$51=\"\",\"\",BK81*'Product Selector'!G$3+BL81)))","v":1650},1600,{"$f":"IF(Hidden!B$52=1,MAX(Hidden!G$49,BM81),BM81)","v":850},850]
["2TLA022310R5100","Orion1 Dongle for Orion1 Extended","Accessory","Orion1 Dongle",{"$nulls":57},{"$f":"IF('Product Selector'!G$3=\"\",\"\",IF(Hidden!B$53=2,IF(Hidden!C$51=\"\",\"\",(1600*'Product Selector'!G$3+IF((1200-0.4*Hidden!C$51)<850,850,(1200-0.4*(Hidden!C$51))))),IF(Hidden!C$51=\"\",\"\",BK82*'Product Selector'!G$3+BL82)))","v":1650},1600,{"$f":"IF(Hidden!B$52=1,MAX(Hidden!G$49,BM82),BM82)","v":850},850]
["2TLA022310R5200","Orion TP-14 -  Test Piece 14 mm","Accessory","Orion TP-14",{"$nulls":57},{"$f":"IF('Product Selector'!G$3=\"\",\"\",IF(Hidden!B$53=2,IF(Hidden!C$51=\"\",\"\",(1600*'Product Selector'!G$3+IF((1200-0.4*Hidden!C$51)<850,850,(1200-0.4*(Hidden!C$51))))),IF(Hidden!C$51=\"\",\"\",BK83*'Product Selector'!G$3+BL83)))","v":1650},1600,{"$f":"IF(Hidden!B$52=1,MAX(Hidden!G$49,BM83),BM83)","v":850},850]
["2TLA022310R5300","Orion TP-30 -  Test Piece 30 mm","Accessory","Orion TP-30",{"$nulls":57},{"$f":"IF('Product Selector'!G$3=\"\",\"\",IF(Hidden!B$53=2,IF(Hidden!C$51=\"\",\"\",(1600*'Product Selector'!G$3+IF((1200-0.4*Hidden!C$51)<850,850,(1200-0.4*(Hidden!C$51))))),IF(Hidden!C$51=\"\",\"\",BK84*'Product Selector'!G$3+BL84)))","v":1650},1600,{"$f":"IF(Hidden!B$52=1,MAX(Hidden!G$49,BM84),BM84)","v":850},850]
["2TLA022311R0100","Orion1 Mirror 060-Dev. mirror excl stand","Accessory","Orion1 Mirror 060",{"$nulls":57},{"$f":"IF('Product Selector'!G$3=\"\",\"\",IF(Hidden!B$53=2,IF(Hidden!C$51=\"\",\"\",(1600*'Product Selector'!G$3+IF((1200-0.4*Hidden!C$51)<850,850,(1200-0.4*(Hidden!C$51))))),IF(Hidden!C$51=\"\",\"\",BK85*'Product Selector'!G$3+BL85)))","v":1650},1600,{"$f":"IF(Hidden!B$52=1,MAX(Hidden!G$49,BM85),BM85)","v":850},850]
["2TLA022311R0200","Orion1 Mirror 090-Dev. mirror excl stand","Accessory","Orion1 Mirror 090",{"$nulls":57},{"$f":"IF('Product Selector'!G$3=\"\",\"\",IF(Hidden!B$53=2,IF(Hidden!C$51=\"\",\"\",(1600*'Product Selector'!G$3+IF((1200-0.4*Hidden!C$51)<850,850,(1200-0.4*(Hidden!C$51))))),IF(Hidden!C$51=\"\",\"\",BK86*'Product Selector'!G$3+BL86)))","v":1650},1600,{"$f":"IF(Hidden!B$52=1,MAX(Hidden!G$49,BM86),BM86)","v":850},850]
["2TLA022311R0300","Orion1 Mirror 120-Dev. mirror excl stand","Accessory","Orion1 Mirror 120",{"$nulls":57},{"$f":"IF('Product Selector'!G$3=\"\",\"\",IF(Hidden!B$53=2,IF(Hidden!C$51=\"\",\"\",(1600*'Product Selector'!G$3+IF((1200-0.4*Hidden!C$51)<850,850,(1200-0.4*(Hidden!C$51))))),IF(Hidden!C$51=\"\",\"\",BK87*'Product Selector'!G$3+BL87)))","v":1650},1600,{"$f":"IF(Hidden!B$52=1,MAX(Hidden!G$49,BM87),BM87)","v":850},850]
["2TLA022311R0400","Orion1 Mirror 165-Dev. mirror excl stand","Accessory","Orion1 Mirror 165",{"$nulls":57},{"$f":"IF('Product Selector'!G$3=\"\",\"\",IF(Hidden!B$53=2,IF(Hidden!C$51=\"\",\"\",(1600*'Product Selector'!G$3+IF((1200-0.4*Hidden!C$51)<850,850,(1200-0.4*(Hidden!C$51))))),IF(Hidden!C$51=\"\",\"\",BK88*'Product Selector'!G$3+BL88)))","v":1650},1600,{"$f":"IF(Hidden!B$52=1,MAX(Hidden!G$49,BM88),BM88)","v":850},850]
["2TLA022311R0500","Orion1 Mirror 190-Dev. mirror excl stand","Accessory","Orion1 Mirror 190",{"$nulls":57},{"$f":"IF('Product Selector'!G$3=\"\",\"\",IF(Hidden!B$53=2,IF(Hidden!C$51=\"\",\"\",(1600*'Product Selector'!G$3+IF((1200-0.4*Hidden!C$51)<850,850,(1200-0.4*(Hidden!C$51))))),IF(Hidden!C$51=\"\",\"\",BK89*'Product Selector'!G$3+BL89)))","v":1650},1600,{"$f":"IF(Hidden!B$52=1,MAX(Hidden!G$49,BM89),BM89)","v":850},850]
["2TLA022312R0000","Orion Stand 060 - Protective stand 60 cm","Accessory","Orion Stand 060",{"$nulls":57},{"$f":"IF('Product Selector'!G$3=\"\",\"\",IF(Hidden!B$53=2,IF(Hidden!C$51=\"\",\"\",(1600*'Product Selector'!G$3+IF((1200-0.4*Hidden!C$51)<850,850,(1200-0.4*(Hidden!C$51))))),IF(Hidden!C$51=\"\",\"\",BK90*'Product Selector'!G$3+BL90)))","v":1650},1600,{"$f":"IF(Hidden!B$52=1,MAX(Hidden!G$49,BM90),BM90)","v":850},850]
["2TLA022312R0100","Orion Stand 100 - Protective stand 100cm","Accessory","Orion Stand 100",{"$nulls":57},{"$f":"IF('Product Selector'!G$3=\"\",\"\",IF(Hidden!B$53=2,IF(Hidden!C$51=\"\",\"\",(1600*'Product Selector'!G$3+IF((1200-0.4*Hidden!C$51)<850,850,(1200-0.4*(Hidden!C$51))))),IF(Hidden!C$51=\"\",\"\",BK91*'Product Selector'!G$3+BL91)))","v":1650},1600,{"$f":"IF(Hidden!B$52=1,MAX(Hidden!G$49,BM91),BM91)","v":850},850]
["2TLA022312R0200","Orion Stand 120 - Protective stand 120cm","Accessory","Orion Stand 120",{"$nulls":57},{"$f":"IF('Product Selector'!G$3=\"\",\"\",IF(Hidden!B$53=2,IF(Hidden!C$51=\"\",\"\",(1600*'Product Selector'!G$3+IF((1200-0.4*Hidden!C$51)<850,850,(1200-0.4*(Hidden!C$51))))),IF(Hidden!C$51=\"\",\"\",BK92*'Product Selector'!G$3+BL92)))","v":1650},1600,{"$f":"IF(Hidden!B$52=1,MAX(Hidden!G$49,BM92),BM92)","v":850},850]
["2TLA022312R0300","Orion Stand 165 - Protective stand 165cm","Accessory","Orion Stand 165",{"$nulls":57},{"$f":"IF('Product Selector'!G$3=\"\",\"\",IF(Hidden!B$53=2,IF(Hidden!C$51=\"\",\"\",(1600*'Product Selector'!G$3+IF((1200-0.4*Hidden!C$51)<850,850,(1200-0.4*(Hidden!C$51))))),IF(Hidden!C$51=\"\",\"\",BK93*'Product Selector'!G$3+BL93)))","v":1650},1600,{"$f":"IF(Hidden!B$52=1,MAX(Hidden!G$49,BM93),BM93)","v":850},850]
["2TLA022312R0400","Orion Stand 190 - Protective stand 190cm","Accessory","Orion Stand 190",{"$nulls":57},{"$f":"IF('Product Selector'!G$3=\"\",\"\",IF(Hidden!B$53=2,IF(Hidden!C$51=\"\",\"\",(1600*'Product Selector'!G$3+IF((1200-0.4*Hidden!C$51)<850,850,(1200-0.4*(Hidden!C$51))))),IF(Hidden!C$51=\"\",\"\",BK94*'Product Selector'!G$3+BL94)))","v":1650},1600,{"$f":"IF(Hidden!B$52=1,MAX(Hidden!G$49,BM94),BM94)","v":850},850]
["2TLA022312R1000","Orion Mirror K050 - Dev. mirror in stand","Accessory","Orion Mirror K050",{"$nulls":57},{"$f":"IF('Product Selector'!G$3=\"\",\"\",IF(Hidden!B$53=2,IF(Hidden!C$51=\"\",\"\",(1600*'Product Selector'!G$3+IF((1200-0.4*Hidden!C$51)<850,850,(1200-0.4*(Hidden!C$51))))),IF(Hidden!C$51=\"\",\"\",BK95*'Product Selector'!G$3+BL95)))","v":1650},1600,{"$f":"IF(Hidden!B$52=1,MAX(Hidden!G$49,BM95),BM95)","v":850},850]
["2TLA022312R1100","Orion Mirror K080 - Dev. mirror in stand","Accessory","Orion Mirror K080",{"$nulls":57},{"$f":"IF('Product Selector'!G$3=\"\",\"\",IF(Hidden!B$53=2,IF(Hidden!C$51=\"\",\"\",(1600*'Product Selector'!G$3+IF((1200-0.4*Hidden!C$51)<850,850,(1200-0.4*(Hidden!C$51))))),IF(Hidden!C$51=\"\",\"\",BK96*'Product Selector'!G$3+BL96)))","v":1650},1600,{"$f":"IF(Hidden!B$52=1,MAX(Hidden!G$49,BM96),BM96)","v":850},850]
["2TLA022312R1200","Orion Mirror K090 - Dev. mirror in stand","Accessory","Orion Mirror K090",{"$nulls":57},{"$f":"IF('Product Selector'!G$3=\"\",\"\",IF(Hidden!B$53=2,IF(Hidden!C$51=\"\",\"\",(1600*'Product Selector'!G$3+IF((1200-0.4*Hidden!C$51)<850,850,(1200-0.4*(Hidden!C$51))))),IF(Hidden!C$51=\"\",\"\",BK97*'Product Selector'!G$3+BL97)))","v":1650},1600,{"$f":"IF(Hidden!B$52=1,MAX(Hidden!G$49,BM97),BM97)","v":850},850]
["2TLA022312R1300","Orion Mirror K120 - Dev. mirror in stand","Accessory","Orion Mirror K120",{"$nulls":57},{"$f":"IF('Product Selector'!G$3=\"\",\"\",IF(Hidden!B$53=2,IF(Hidden!C$51=\"\",\"\",(1600*'Product Selector'!G$3+IF((1200-0.4*Hidden!C$51)<850,850,(1200-0.4*(Hidden!C$51))))),IF(Hidden!C$51=\"\",\"\",BK98*'Product Selector'!G$3+BL98)))","v":1650},1600,{"$f":"IF(Hidden!B$52=1,MAX(Hidden!G$49,BM98),BM98)","v":850},850]
["2TLA022312R5000","Orion Stand Plate - Adjustment of Stand","Accessory","Orion Stand Plate",{"$nulls":57},{"$f":"IF('Product Selector'!G$3=\"\",\"\",IF(Hidden!B$53=2,IF(Hidden!C$51=\"\",\"\",(1600*'Product Selector'!G$3+IF((1200-0.4*Hidden!C$51)<850,850,(1200-0.4*(Hidden!C$51))))),IF(Hidden!C$51=\"\",\"\",BK99*'Product Selector'!G$3+BL99)))","v":1650},1600,{"$f":"IF(Hidden!B$52=1,MAX(Hidden!G$49,BM99),BM99)","v":850},850]
["2TLA022313R0000","Orion WET-015 -Protective tube for O1B","Accessory","Orion WET-015",{"$nulls":57},{"$f":"IF('Product Selector'!G$3=\"\",\"\",IF(Hidden!B$53=2,IF(Hidden!C$51=\"\",\"\",(1600*'Product Selector'!G$3+IF((1200-0.4*Hidden!C$51)<850,850,(1200-0.4*(Hidden!C$51))))),IF(Hidden!C$51=\"\",\"\",BK100*'Product Selector'!G$3+BL100)))","v":1650},1600,{"$f":"IF(Hidden!B$52=1,MAX(Hidden!G$49,BM100),BM100)","v":850},850]
["2TLA022313R0100","Orion WET-030 -Protective tube for O1B","Accessory","Orion WET-030",{"$nulls":57},{"$f":"IF('Product Selector'!G$3=\"\",\"\",IF(Hidden!B$53=2,IF(Hidden!C$51=\"\",\"\",(1600*'Product Selector'!G$3+IF((1200-0.4*Hidden!C$51)<850,850,(1200-0.4*(Hidden!C$51))))),IF(Hidden!C$51=\"\",\"\",BK101*'Product Selector'!G$3+BL101)))","v":1650},1600,{"$f":"IF(Hidden!B$52=1,MAX(Hidden!G$49,BM101),BM101)","v":850},850]
["2TLA022313R0200","Orion WET-045 -Protective tube for O1B","Accessory","Orion WET-045",{"$nulls":57},{"$f":"IF('Product Selector'!G$3=\"\",\"\",IF(Hidden!B$53=2,IF(Hidden!C$51=\"\",\"\",(1600*'Product Selector'!G$3+IF((1200-0.4*Hidden!C$51)<850,850,(1200-0.4*(Hidden!C$51))))),IF(Hidden!C$51=\"\",\"\",BK102*'Product Selector'!G$3+BL102)))","v":1650},1600,{"$f":"IF(Hidden!B$52=1,MAX(Hidden!G$49,BM102),BM102)","v":850},850]
["2TLA022313R0300","Orion WET-060 -Protective tube for O1B","Accessory","Orion WET-060",{"$nulls":57},{"$f":"IF('Product Selector'!G$3=\"\",\"\",IF(Hidden!B$53=2,IF(Hidden!C$51=\"\",\"\",(1600*'Product Selector'!G$3+IF((1200-0.4*Hidden!C$51)<850,850,(1200-0.4*(Hidden!C$51))))),IF(Hidden!C$51=\"\",\"\",BK103*'Product Selector'!G$3+BL103)))","v":1650},1600,{"$f":"IF(Hidden!B$52=1,MAX(Hidden!G$49,BM103),BM103)","v":850},850]
["2TLA022313R0400","Orion WET-075 -Protective tube for O1B","Accessory","Orion WET-075",{"$nulls":57},{"$f":"IF('Product Selector'!G$3=\"\",\"\",IF(Hidden!B$53=2,IF(Hidden!C$51=\"\",\"\",(1600*'Product Selector'!G$3+IF((1200-0.4*Hidden!C$51)<850,850,(1200-0.4*(Hidden!C$51))))),IF(Hidden!C$51=\"\",\"\",BK104*'Product Selector'!G$3+BL104)))","v":1650},1600,{"$f":"IF(Hidden!B$52=1,MAX(Hidden!G$49,BM104),BM104)","v":850},850]
["2TLA022313R0500","Orion WET-090 -Protective tube for O1B","Accessory","Orion WET-090",{"$nulls":57},{"$f":"IF('Product Selector'!G$3=\"\",\"\",IF(Hidden!B$53=2,IF(Hidden!C$51=\"\",\"\",(1600*'Product Selector'!G$3+IF((1200-0.4*Hidden!C$51)<850,850,(1200-0.4*(Hidden!C$51))))),IF(Hidden!C$51=\"\",\"\",BK105*'Product Selector'!G$3+BL105)))","v":1650},1600,{"$f":"IF(Hidden!B$52=1,MAX(Hidden!G$49,BM105),BM105)","v":850},850]
["2TLA022313R0600","Orion WET-105 -Protective tube for O1B","Accessory","Orion WET-105",{"$nulls":57},{"$f":"IF('Product Selector'!G$3=\"\",\"\",IF(Hidden!B$53=2,IF(Hidden!C$51=\"\",\"\",(1600*'Product Selector'!G$3+IF((1200-0.4*Hidden!C$51)<850,850,(1200-0.4*(Hidden!C$51))))),IF(Hidden!C$51=\"\",\"\",BK106*'Product Selector'!G$3+BL106)))","v":1650},1600,{"$f":"IF(Hidden!B$52=1,MAX(Hidden!G$49,BM106),BM106)","v":850},850]
["2TLA022313R0700","Orion WET-120 -Protective tube for O1B","Accessory","Orion WET-120",{"$nulls":57},{"$f":"IF('Product Selector'!G$3=\"\",\"\",IF(Hidden!B$53=2,IF(Hidden!C$51=\"\",\"\",(1600*'Product Selector'!G$3+IF((1200-0.4*Hidden!C$51)<850,850,(1200-0.4*(Hidden!C$51))))),IF(Hidden!C$51=\"\",\"\",BK107*'Product Selector'!G$3+BL107)))","v":1650},1600,{"$f":"IF(Hidden!B$52=1,MAX(Hidden!G$49,BM107),BM107)","v":850},850]
["2TLA022313R0800","Orion WET-135 -Protective tube for O1B","Accessory","Orion WET-135",{"$nulls":57},{"$f":"IF('Product Selector'!G$3=\"\",\"\",IF(Hidden!B$53=2,IF(Hidden!C$51=\"\",\"\",(1600*'Product Selector'!G$3+IF((1200-0.4*Hidden!C$51)<850,850,(1200-0.4*(Hidden!C$51))))),IF(Hidden!C$51=\"\",\"\",BK108*'Product Selector'!G$3+BL108)))","v":1650},1600,{"$f":"IF(Hidden!B$52=1,MAX(Hidden!G$49,BM108),BM108)","v":850},850]
["2TLA022313R0900","Orion WET-150 -Protective tube for O1B","Accessory","Orion WET-150",{"$nulls":57},{"$f":"IF('Product Selector'!G$3=\"\",\"\",IF(Hidden!B$53=2,IF(Hidden!C$51=\"\",\"\",(1600*'Product Selector'!G$3+IF((1200-0.4*Hidden!C$51)<850,850,(1200-0.4*(Hidden!C$51))))),IF(Hidden!C$51=\"\",\"\",BK109*'Product Selector'!G$3+BL109)))","v":1650},1600,{"$f":"IF(Hidden!B$52=1,MAX(Hidden!G$49,BM109),BM109)","v":850},850]
["2TLA022313R1000","Orion WET-165 -Protective tube for O1B","Accessory","Orion WET-165",{"$nulls":57},{"$f":"IF('Product Selector'!G$3=\"\",\"\",IF(Hidden!B$53=2,IF(Hidden!C$51=\"\",\"\",(1600*'Product Selector'!G$3+IF((1200-0.4*Hidden!C$51)<850,850,(1200-0.4*(Hidden!C$51))))),IF(Hidden!C$51=\"\",\"\",BK110*'Product Selector'!G$3+BL110)))","v":1650},1600,{"$f":"IF(Hidden!B$52=1,MAX(Hidden!G$49,BM110),BM110)","v":850},850]
["2TLA022313R1100","Orion WET-180 -Protective tube for O1B","Accessory","Orion WET-180",{"$nulls":57},{"$f":"IF('Product Selector'!G$3=\"\",\"\",IF(Hidden!B$53=2,IF(Hidden!C$51=\"\",\"\",(1600*'Product Selector'!G$3+IF((1200-0.4*Hidden!C$51)<850,850,(1200-0.4*(Hidden!C$51))))),IF(Hidden!C$51=\"\",\"\",BK111*'Product Selector'!G$3+BL111)))","v":1650},1600,{"$f":"IF(Hidden!B$52=1,MAX(Hidden!G$49,BM111),BM111)","v":850},850]
["2TLA022313R3000","Orion WET-K050 - Protective tube for O2","Accessory","Orion WET-K050",{"$nulls":57},{"$f":"IF('Product Selector'!G$3=\"\",\"\",IF(Hidden!B$53=2,IF(Hidden!C$51=\"\",\"\",(1600*'Product Selector'!G$3+IF((1200-0.4*Hidden!C$51)<850,850,(1200-0.4*(Hidden!C$51))))),IF(Hidden!C$51=\"\",\"\",BK112*'Product Selector'!G$3+BL112)))","v":1650},1600,{"$f":"IF(Hidden!B$52=1,MAX(Hidden!G$49,BM112),BM112)","v":850},850]
["2TLA022313R3100","Orion WET-K080 - Protective tube for O2","Accessory","Orion WET-K080",{"$nulls":57},{"$f":"IF('Product Selector'!G$3=\"\",\"\",IF(Hidden!B$53=2,IF(Hidden!C$51=\"\",\"\",(1600*'Product Selector'!G$3+IF((1200-0.4*Hidden!C$51)<850,850,(1200-0.4*(Hidden!C$51))))),IF(Hidden!C$51=\"\",\"\",BK113*'Product Selector'!G$3+BL113)))","v":1650},1600,{"$f":"IF(Hidden!B$52=1,MAX(Hidden!G$49,BM113),BM113)","v":850},850]
["2TLA022313R3200","Orion WET-K090 - Protective tube for O2","Accessory","Orion WET-K090",{"$nulls":57},{"$f":"IF('Product Selector'!G$3=\"\",\"\",IF(Hidden!B$53=2,IF(Hidden!C$51=\"\",\"\",(1600*'Product Selector'!G$3+IF((1200-0.4*Hidden!C$51)<850,850,(1200-0.4*(Hidden!C$51))))),IF(Hidden!C$51=\"\",\"\",BK114*'Product Selector'!G$3+BL114)))","v":1650},1600,{"$f":"IF(Hidden!B$52=1,MAX(Hidden!G$49,BM114),BM114)","v":850},850]
["2TLA022313R3300","Orion WET-K120 - Protective tube for O2","Accessory","Orion WET-K120",{"$nulls":57},{"$f":"IF('Product Selector'!G$3=\"\",\"\",IF(Hidden!B$53=2,IF(Hidden!C$51=\"\",\"\",(1600*'Product Selector'!G$3+IF((1200-0.4*Hidden!C$51)<850,850,(1200-0.4*(Hidden!C$51))))),IF(Hidden!C$51=\"\",\"\",BK115*'Product Selector'!G$3+BL115)))","v":1650},1600,{"$f":"IF(Hidden!B$52=1,MAX(Hidden!G$49,BM115),BM115)","v":850},850]
["2TLA022313R5000","Orion Shield-015 - Lens shield for O1B","Accessory","Orion Shield-015",{"$nulls":57},{"$f":"IF('Product Selector'!G$3=\"\",\"\",IF(Hidden!B$53=2,IF(Hidden!C$51=\"\",\"\",(1600*'Product Selector'!G$3+IF((1200-0.4*Hidden!C$51)<850,850,(1200-0.4*(Hidden!C$51))))),IF(Hidden!C$51=\"\",\"\",BK116*'Product Selector'!G$3+BL116)))","v":1650},1600,{"$f":"IF(Hidden!B$52=1,MAX(Hidden!G$49,BM116),BM116)","v":850},850]
["2TLA022313R5100","Orion Shield-030 - Lens shield for O1B","Accessory","Orion Shield-030",{"$nulls":57},{"$f":"IF('Product Selector'!G$3=\"\",\"\",IF(Hidden!B$53=2,IF(Hidden!C$51=\"\",\"\",(1600*'Product Selector'!G$3+IF((1200-0.4*Hidden!C$51)<850,850,(1200-0.4*(Hidden!C$51))))),IF(Hidden!C$51=\"\",\"\",BK117*'Product Selector'!G$3+BL117)))","v":1650},1600,{"$f":"IF(Hidden!B$52=1,MAX(Hidden!G$49,BM117),BM117)","v":850},850]
["2TLA022313R5200","Orion Shield-045 - Lens shield for O1B","Accessory","Orion Shield-045",{"$nulls":57},{"$f":"IF('Product Selector'!G$3=\"\",\"\",IF(Hidden!B$53=2,IF(Hidden!C$51=\"\",\"\",(1600*'Product Selector'!G$3+IF((1200-0.4*Hidden!C$51)<850,850,(1200-0.4*(Hidden!C$51))))),IF(Hidden!C$51=\"\",\"\",BK118*'Product Selector'!G$3+BL118)))","v":1650},1600,{"$f":"IF(Hidden!B$52=1,MAX(Hidden!G$49,BM118),BM118)","v":850},850]
["2TLA022313R5300","Orion Shield-060 - Lens shield for O1B","Accessory","Orion Shield-060",{"$nulls":57},{"$f":"IF('Product Selector'!G$3=\"\",\"\",IF(Hidden!B$53=2,IF(Hidden!C$51=\"\",\"\",(1600*'Product Selector'!G$3+IF((1200-0.4*Hidden!C$51)<850,850,(1200-0.4*(Hidden!C$51))))),IF(Hidden!C$51=\"\",\"\",BK119*'Product Selector'!G$3+BL119)))","v":1650},1600,{"$f":"IF(Hidden!B$52=1,MAX(Hidden!G$49,BM119),BM119)","v":850},850]
["2TLA022313R5400","Orion Shield-075 - Lens shield for O1B","Accessory","Orion Shield-075",{"$nulls":57},{"$f":"IF('Product Selector'!G$3=\"\",\"\",IF(Hidden!B$53=2,IF(Hidden!C$51=\"\",\"\",(1600*'Product Selector'!G$3+IF((1200-0.4*Hidden!C$51)<850,850,(1200-0.4*(Hidden!C$51))))),IF(Hidden!C$51=\"\",\"\",BK120*'Product Selector'!G$3+BL120)))","v":1650},1600,{"$f":"IF(Hidden!B$52=1,MAX(Hidden!G$49,BM120),BM120)","v":850},850]
["2TLA022313R5500","Orion Shield-090 - Lens shield for O1B","Accessory","Orion Shield-090",{"$nulls":57},{"$f":"IF('Product Selector'!G$3=\"\",\"\",IF(Hidden!B$53=2,IF(Hidden!C$51=\"\",\"\",(1600*'Product Selector'!G$3+IF((1200-0.4*Hidden!C$51)<850,850,(1200-0.4*(Hidden!C$51))))),IF(Hidden!C$51=\"\",\"\",BK121*'Product Selector'!G$3+BL121)))","v":1650},1600,{"$f":"IF(Hidden!B$52=1,MAX(Hidden!G$49,BM121),BM121)","v":850},850]
["2TLA022313R5600","Orion Shield-105 - Lens shield for O1B","Accessory","Orion Shield-105",{"$nulls":57},{"$f":"IF('Product Selector'!G$3=\"\",\"\",IF(Hidden!B$53=2,IF(Hidden!C$51=\"\",\"\",(1600*'Product Selector'!G$3+IF((1200-0.4*Hidden!C$51)<850,850,(1200-0.4*(Hidden!C$51))))),IF(Hidden!C$51=\"\",\"\",BK122*'Product Selector'!G$3+BL122)))","v":1650},1600,{"$f":"IF(Hidden!B$52=1,MAX(Hidden!G$49,BM122),BM122)","v":850},850]
["2TLA022313R5700","Orion Shield-120 - Lens shield for O1B","Accessory","Orion Shield-120",{"$nulls":57},{"$f":"IF('Product Selector'!G$3=\"\",\"\",IF(Hidden!B$53=2,IF(Hidden!C$51=\"\",\"\",(1600*'Product Selector'!G$3+IF((1200-0.4*Hidden!C$51)<850,850,(1200-0.4*(Hidden!C$51))))),IF(Hidden!C$51=\"\",\"\",BK123*'Product Selector'!G$3+BL123)))","v":1650},1600,{"$f":"IF(Hidden!B$52=1,MAX(Hidden!G$49,BM123),BM123)","v":850},850]
["2TLA022313R5800","Orion Shield-135 - Lens shield for O1B","Accessory","Orion Shield-135",{"$nulls":57},{"$f":"IF('Product Selector'!G$3=\"\",\"\",IF(Hidden!B$53=2,IF(Hidden!C$51=\"\",\"\",(1600*'Product Selector'!G$3+IF((1200-0.4*Hidden!C$51)<850,850,(1200-0.4*(Hidden!C$51))))),IF(Hidden!C$51=\"\",\"\",BK124*'Product Selector'!G$3+BL124)))","v":1650},1600,{"$f":"IF(Hidden!B$52=1,MAX(Hidden!G$49,BM124),BM124)","v":850},850]
["2TLA022313R5900","Orion Shield-150 - Lens shield for O1B","Accessory","Orion Shield-150",{"$nulls":57},{"$f":"IF('Product Selector'!G$3=\"\",\"\",IF(Hidden!B$53=2,IF(Hidden!C$51=\"\",\"\",(1600*'Product Selector'!G$3+IF((1200-0.4*Hidden!C$51)<850,850,(1200-0.4*(Hidden!C$51))))),IF(Hidden!C$51=\"\",\"\",BK125*'Product Selector'!G$3+BL125)))","v":1650},1600,{"$f":"IF(Hidden!B$52=1,MAX(Hidden!G$49,BM125),BM125)","v":850},850]
["2TLA022313R6000","Orion Shield-165 - Lens shield for O1B","Accessory","Orion Shield-165",{"$nulls":57},{"$f":"IF('Product Selector'!G$3=\"\",\"\",IF(Hidden!B$53=2,IF(Hidden!C$51=\"\",\"\",(1600*'Product Selector'!G$3+IF((1200-0.4*Hidden!C$51)<850,850,(1200-0.4*(Hidden!C$51))))),IF(Hidden!C$51=\"\",\"\",BK126*'Product Selector'!G$3+BL126)))","v":1650},1600,{"$f":"IF(Hidden!B$52=1,MAX(Hidden!G$49,BM126),BM126)","v":850},850]
["2TLA022313R6100","Orion Shield-180 - Lens shield for O1B","Accessory","Orion Shield-180",{"$nulls":57},{"$f":"IF('Product Selector'!G$3=\"\",\"\",IF(Hidden!B$53=2,IF(Hidden!C$51=\"\",\"\",(1600*'Product Selector'!G$3+IF((1200-0.4*Hidden!C$51)<850,850,(1200-0.4*(Hidden!C$51))))),IF(Hidden!C$51=\"\",\"\",BK127*'Product Selector'!G$3+BL127)))","v":1650},1600,{"$f":"IF(Hidden!B$52=1,MAX(Hidden!G$49,BM127),BM127)","v":850},850]
["2TLA022313R8000","Orion Shield-K050 - Lens shield for O2","Accessory","Orion Shield-K050",{"$nulls":57},{"$f":"IF('Product Selector'!G$3=\"\",\"\",IF(Hidden!B$53=2,IF(Hidden!C$51=\"\",\"\",(1600*'Product Selector'!G$3+IF((1200-0.4*Hidden!C$51)<850,850,(1200-0.4*(Hidden!C$51))))),IF(Hidden!C$51=\"\",\"\",BK128*'Product Selector'!G$3+BL128)))","v":1650},1600,{"$f":"IF(Hidden!B$52=1,MAX(Hidden!G$49,BM128),BM128)","v":850},850]
["2TLA022313R8100","Orion Shield-K080 - Lens shield for O2","Accessory","Orion Shield-K080",{"$nulls":57},{"$f":"IF('Product Selector'!G$3=\"\",\"\",IF(Hidden!B$53=2,IF(Hidden!C$51=\"\",\"\",(1600*'Product Selector'!G$3+IF((1200-0.4*Hidden!C$51)<850,850,(1200-0.4*(Hidden!C$51))))),IF(Hidden!C$51=\"\",\"\",BK129*'Product Selector'!G$3+BL129)))","v":1650},1600,{"$f":"IF(Hidden!B$52=1,MAX(Hidden!G$49,BM129),BM129)","v":850},850]
["2TLA022313R8200","Orion Shield-K090 - Lens shield for O2","Accessory","Orion Shield-K090",{"$nulls":57},{"$f":"IF('Product Selector'!G$3=\"\",\"\",IF(Hidden!B$53=2,IF(Hidden!C$51=\"\",\"\",(1600*'Product Selector'!G$3+IF((1200-0.4*Hidden!C$51)<850,850,(1200-0.4*(Hidden!C$51))))),IF(Hidden!C$51=\"\",\"\",BK130*'Product Selector'!G$3+BL130)))","v":1650},1600,{"$f":"IF(Hidden!B$52=1,MAX(Hidden!G$49,BM130),BM130)","v":850},850]
["2TLA022313R8300","Orion Shield-K120 - Lens shield for O2","Accessory","Orion Shield-K120",{"$nulls":57},{"$f":"IF('Product Selector'!G$3=\"\",\"\",IF(Hidden!B$53=2,IF(Hidden!C$51=\"\",\"\",(1600*'Product Selector'!G$3+IF((1200-0.4*Hidden!C$51)<850,850,(1200-0.4*(Hidden!C$51))))),IF(Hidden!C$51=\"\",\"\",BK131*'Product Selector'!G$3+BL131)))","v":1650},1600,{"$f":"IF(Hidden!B$52=1,MAX(Hidden!G$49,BM131),BM131)","v":850},850]
["2TLA022315R0100","M12-C02PT2T - Transmitter cable for O1E","Accessory","M12-C02PT2T",{"$nulls":57},{"$f":"IF('Product Selector'!G$3=\"\",\"\",IF(Hidden!B$53=2,IF(Hidden!C$51=\"\",\"\",(1600*'Product Selector'!G$3+IF((1200-0.4*Hidden!C$51)<850,850,(1200-0.4*(Hidden!C$51))))),IF(Hidden!C$51=\"\",\"\",BK132*'Product Selector'!G$3+BL132)))","v":1650},1600,{"$f":"IF(Hidden!B$52=1,MAX(Hidden!G$49,BM132),BM132)","v":850},850]
["2TLA022315R0200","M12-C02PT6RB-Receiver cable Blanking O1E","Accessory","M12-C02PT6RB",{"$nulls":57},{"$f":"IF('Product Selector'!G$3=\"\",\"\",IF(Hidden!B$53=2,IF(Hidden!C$51=\"\",\"\",(1600*'Product Selector'!G$3+IF((1200-0.4*Hidden!C$51)<850,850,(1200-0.4*(Hidden!C$51))))),IF(Hidden!C$51=\"\",\"\",BK133*'Product Selector'!G$3+BL133)))","v":1650},{"$f":"IF(OR(C133=\"finger\",C133=\"hand\"),2000,1600)","v":1600},{"$f":"IF(Hidden!B$52=1,MAX(Hidden!G$49,BM133),BM133)","v":850},{"$f":"IF(C133=\"finger\",0,IF(C133=\"Hand\",128,850))","v":850}]
["2TLA022315R0300","M12-C02PT62RM -Receiver cable Muting O1E","Accessory","M12-C02PT62RM",{"$nulls":57},{"$f":"IF('Product Selector'!G$3=\"\",\"\",IF(Hidden!B$53=2,IF(Hidden!C$51=\"\",\"\",(1600*'Product Selector'!G$3+IF((1200-0.4*Hidden!C$51)<850,850,(1200-0.4*(Hidden!C$51))))),IF(Hidden!C$51=\"\",\"\",BK134*'Product Selector'!G$3+BL134)))","v":1650},1600,{"$f":"IF(Hidden!B$52=1,MAX(Hidden!G$49,BM134),BM134)","v":850},850]
["2TLA022315R1000","PT-C1PT - Cascade cable for O1E, 1 m","Accessory","PT-C1PT",{"$nulls":57},{"$f":"IF('Product Selector'!G$3=\"\",\"\",IF(Hidden!B$53=2,IF(Hidden!C$51=\"\",\"\",(1600*'Product Selector'!G$3+IF((1200-0.4*Hidden!C$51)<850,850,(1200-0.4*(Hidden!C$51))))),IF(Hidden!C$51=\"\",\"\",BK135*'Product Selector'!G$3+BL135)))","v":1650},1600,{"$f":"IF(Hidden!B$52=1,MAX(Hidden!G$49,BM135),BM135)","v":850},850]
["2TLA022315R1100","PT-C05PT - Cascade cable for O1E, 0.5 m","Accessory","PT-C05PT",{"$nulls":57},{"$f":"IF('Product Selector'!G$3=\"\",\"\",IF(Hidden!B$53=2,IF(Hidden!C$51=\"\",\"\",(1600*'Product Selector'!G$3+IF((1200-0.4*Hidden!C$51)<850,850,(1200-0.4*(Hidden!C$51))))),IF(Hidden!C$51=\"\",\"\",BK136*'Product Selector'!G$3+BL136)))","v":1650},1600,{"$f":"IF(Hidden!B$52=1,MAX(Hidden!G$49,BM136),BM136)","v":850},850]
["2TLA022315R1200","PT-C005PT -Cascade cable for O1E, 0.05 m","Accessory","PT-C005PT",{"$nulls":57},{"$f":"IF('Product Selector'!G$3=\"\",\"\",IF(Hidden!B$53=2,IF(Hidden!C$51=\"\",\"\",(1600*'Product Selector'!G$3+IF((1200-0.4*Hidden!C$51)<850,850,(1200-0.4*(Hidden!C$51))))),IF(Hidden!C$51=\"\",\"\",BK137*'Product Selector'!G$3+BL137)))","v":1650},1600,{"$f":"IF(Hidden!B$52=1,MAX(Hidden!G$49,BM137),BM137)","v":850},850]
["2TLA022315R2000","ETH-C12 - O1 E Dongle Ethernet cable, 1m","Accessory","ETH-C12",{"$nulls":57},{"$f":"IF('Product Selector'!G$3=\"\",\"\",IF(Hidden!B$53=2,IF(Hidden!C$51=\"\",\"\",(1600*'Product Selector'!G$3+IF((1200-0.4*Hidden!C$51)<850,850,(1200-0.4*(Hidden!C$51))))),IF(Hidden!C$51=\"\",\"\",BK138*'Product Selector'!G$3+BL138)))","v":1650},1600,{"$f":"IF(Hidden!B$52=1,MAX(Hidden!G$49,BM138),BM138)","v":850},850]
["2TLA022315R2100","ETH-C32 - O1 E Dongle Ethernet cable, 3m","Accessory","ETH-C32",{"$nulls":57},{"$f":"IF('Product Selector'!G$3=\"\",\"\",IF(Hidden!B$53=2,IF(Hidden!C$51=\"\",\"\",(1600*'Product Selector'!G$3+IF((1200-0.4*Hidden!C$51)<850,850,(1200-0.4*(Hidden!C$51))))),IF(Hidden!C$51=\"\",\"\",BK139*'Product Selector'!G$3+BL139)))","v":1650},1600,{"$f":"IF(Hidden!B$52=1,MAX(Hidden!G$49,BM139),BM139)","v":850},850]
["2TLA022315R2200","ETH-C52 - O1 E Dongle Ethernet cable, 5m","Accessory","ETH-C52",{"$nulls":57},{"$f":"IF('Product Selector'!G$3=\"\",\"\",IF(Hidden!B$53=2,IF(Hidden!C$51=\"\",\"\",(1600*'Product Selector'!G$3+IF((1200-0.4*Hidden!C$51)<850,850,(1200-0.4*(Hidden!C$51))))),IF(Hidden!C$51=\"\",\"\",BK140*'Product Selector'!G$3+BL140)))","v":1650},1600,{"$f":"IF(Hidden!B$52=1,MAX(Hidden!G$49,BM140),BM140)","v":850},850]
["2TLA020056R7200","M12-C65 6 m cable 12×0.34 M12 female","Accessory","M12-C65",{"$nulls":57},{"$f":"IF('Product Selector'!G$3=\"\",\"\",IF(Hidden!B$53=2,IF(Hidden!C$51=\"\",\"\",(1600*'Product Selector'!G$3+IF((1200-0.4*Hidden!C$51)<850,850,(1200-0.4*(Hidden!C$51))))),IF(Hidden!C$51=\"\",\"\",BK141*'Product Selector'!G$3+BL141)))","v":1650},1600,{"$f":"IF(Hidden!B$52=1,MAX(Hidden!G$49,BM141),BM141)","v":850},850]
["2TLA020056R7300","M12-C105 10 m cable 12×0.34 M12 female","Accessory","M12-C105",{"$nulls":57},{"$f":"IF('Product Selector'!G$3=\"\",\"\",IF(Hidden!B$53=2,IF(Hidden!C$51=\"\",\"\",(1600*'Product Selector'!G$3+IF((1200-0.4*Hidden!C$51)<850,850,(1200-0.4*(Hidden!C$51))))),IF(Hidden!C$51=\"\",\"\",BK142*'Product Selector'!G$3+BL142)))","v":1650},1600,{"$f":"IF(Hidden!B$52=1,MAX(Hidden!G$49,BM142),BM142)","v":850},850]
["2TLA020056R7500","M12-C205 20 m cable 12×0.34 M12 female","Accessory","M12-C205",{"$nulls":46},"1 pc 2TLA022311R0100\n 1 pc 2TLA022310R0900\n1 pc 2TLA022312R0000","Orion1 Mirror 060\nJSM Orion11\nOrion Stand 060",{"$nulls":9},{"$f":"IF('Product Selector'!G$3=\"\",\"\",IF(Hidden!B$53=2,IF(Hidden!C$51=\"\",\"\",(1600*'Product Selector'!G$3+IF((1200-0.4*Hidden!C$51)<850,850,(1200-0.4*(Hidden!C$51))))),IF(Hidden!C$51=\"\",\"\",BK143*'Product Selector'!G$3+BL143)))","v":1650},1600,{"$f":"IF(Hidden!B$52=1,MAX(Hidden!G$49,BM143),BM143)","v":850},850]
[{"$nulls":50}," 1 pc 2TLA022310R0900","JSM Orion11"]
[{"$nulls":50},"1 pc 2TLA022312R0000","Orion Stand 060"]

{"sheet":"tmp","index":3,"n_rows":113,"n_cols":11,"rows_kept":113,"cut":false,"hidden":true,"merged":[]}
{"$rows_empty":51}
[null,"2TLA022300R0000","Orion1-4-14-015-B  Transmitter+ Receiver","Finger",150,800,233.3,0.2,6,11,"No"]
[null,"2TLA022300R0100","Orion1-4-14-030-B  Transmitter+ Receiver","Finger",300,800,383.2,0.2,6,15,"No"]
[null,"2TLA022300R0200","Orion1-4-14-045-B  Transmitter+ Receiver","Finger",450,800,533.20000000000005,0.2,6,18,"No"]
[null,"2TLA022300R0300","Orion1-4-14-060-B  Transmitter+ Receiver","Finger",600,800,683.2,0.2,6,22,"No"]
[null,"2TLA022300R0400","Orion1-4-14-075-B  Transmitter+ Receiver","Finger",750,800,833.2,0.2,6,25,"No"]
[null,"2TLA022300R0500","Orion1-4-14-090-B  Transmitter+ Receiver","Finger",900,800,983.2,0.2,6,29,"No"]
[null,"2TLA022300R0600","Orion1-4-14-105-B  Transmitter+ Receiver","Finger",1050,800,1133.2,0.2,6,33,"No"]
[null,"2TLA022300R0700","Orion1-4-14-120-B  Transmitter+ Receiver","Finger",1200,800,1283.3,0.2,6,36,"No"]
[null,"2TLA022300R0800","Orion1-4-14-135-B  Transmitter+ Receiver","Finger",1350,800,1433.2,0.2,6,40,"No"]
[null,"2TLA022300R0900","Orion1-4-14-150-B  Transmitter+ Receiver","Finger",1500,800,1583.3,0.2,6,43,"No"]
[null,"2TLA022300R1000","Orion1-4-14-165-B  Transmitter+ Receiver","Finger",1650,800,1733.3,0.2,6,47,"No"]
[null,"2TLA022300R1100","Orion1-4-14-180-B  Transmitter+ Receiver","Finger",1800,800,1883.3,0.2,6,50,"No"]
[null,"2TLA022301R0100","Orion1-4-14-030-E  Transmitter+ Receiver","Finger",300,800,306.3,0.2,7,15,"Muting, blanking"]
[null,"2TLA022301R0200","Orion1-4-14-045-E  Transmitter+ Receiver","Finger",450,800,456.3,0.2,7,17,"Muting, blanking"]
[null,"2TLA022301R0300","Orion1-4-14-060-E  Transmitter+ Receiver","Finger",600,800,606.29999999999995,0.2,7,19,"Muting, blanking"]
[null,"2TLA022301R0400","Orion1-4-14-075-E  Transmitter+ Receiver","Finger",750,800,756.3,0.2,7,20,"Muting, blanking"]
[null,"2TLA022301R0500","Orion1-4-14-090-E  Transmitter+ Receiver","Finger",900,800,906.3,0.2,7,22,"Muting, blanking"]
[null,"2TLA022301R0600","Orion1-4-14-105-E  Transmitter+ Receiver","Finger",1050,800,1056.3,0.2,7,24,"Muting, blanking"]
[null,"2TLA022301R0700","Orion1-4-14-120-E  Transmitter+ Receiver","Finger",1200,800,1206.3,0.2,7,26,"Muting, blanking"]
[null,"2TLA022301R0800","Orion1-4-14-135-E  Transmitter+ Receiver","Finger",1350,800,1356.3,0.2,7,27,"Muting, blanking"]
[null,"2TLA022301R0900","Orion1-4-14-150-E  Transmitter+ Receiver","Finger",1500,800,1506.3,0.2,7,29,"Muting, blanking"]
[null,"2TLA022301R1000","Orion1-4-14-165-E  Transmitter+ Receiver","Finger",1650,800,1656.3,0.2,7,31,"Muting, blanking"]
[null,"2TLA022301R1100","Orion1-4-14-180-E  Transmitter+ Receiver","Finger",1800,800,1806.3,0.2,7,33,"Muting, blanking"]
[null,"2TLA022302R0000","Orion1-4-30-015-B  Transmitter+ Receiver","Hand",150,928,233.3,0.2,19,9,"No"]
[null,"2TLA022302R0100","Orion1-4-30-030-B  Transmitter+ Receiver","Hand",300,928,383.2,0.2,19,11,"No"]
[null,"2TLA022302R0200","Orion1-4-30-045-B  Transmitter+ Receiver","Hand",450,928,533.20000000000005,0.2,19,13,"No"]
[null,"2TLA022302R0300","Orion1-4-30-060-B  Transmitter+ Receiver","Hand",600,928,683.2,0.2,19,14,"No"]
[null,"2TLA022302R0400","Orion1-4-30-075-B  Transmitter+ Receiver","Hand",750,928,833.2,0.2,19,16,"No"]
[null,"2TLA022302R0500","Orion1-4-30-090-B  Transmitter+ Receiver","Hand",900,928,983.2,0.2,19,18,"No"]
[null,"2TLA022302R0600","Orion1-4-30-105-B  Transmitter+ Receiver","Hand",1050,928,1133.2,0.2,19,19,"No"]
[null,"2TLA022302R0700","Orion1-4-30-120-B  Transmitter+ Receiver","Hand",1200,928,1283.3,0.2,19,21,"No"]
[null,"2TLA022302R0800","Orion1-4-30-135-B  Transmitter+ Receiver","Hand",1350,928,1433.2,0.2,19,23,"No"]
[null,"2TLA022302R0900","Orion1-4-30-150-B  Transmitter+ Receiver","Hand",1500,928,1583.3,0.2,19,25,"No"]
[null,"2TLA022302R1000","Orion1-4-30-165-B  Transmitter+ Receiver","Hand",1650,928,1733.3,0.2,19,26,"No"]
[null,"2TLA022302R1100","Orion1-4-30-180-B  Transmitter+ Receiver","Hand",1800,928,1883.3,0.2,19,28,"No"]
[null,"2TLA022303R0100","Orion1-4-30-030-E  Transmitter+ Receiver","Hand",300,928,306.3,0.2,20,13,"Muting, blanking"]
[null,"2TLA022303R0200","Orion1-4-30-045-E  Transmitter+ Receiver","Hand",450,928,456.3,0.2,20,14,"Muting, blanking"]
[null,"2TLA022303R0300","Orion1-4-30-060-E  Transmitter+ Receiver","Hand",600,928,606.29999999999995,0.2,20,15,"Muting, blanking"]
[null,"2TLA022303R0400","Orion1-4-30-075-E  Transmitter+ Receiver","Hand",750,928,756.3,0.2,20,16,"Muting, blanking"]
[null,"2TLA022303R0500","Orion1-4-30-090-E  Transmitter+ Receiver","Hand",900,928,906.3,0.2,20,17,"Muting, blanking"]
[null,"2TLA022303R0600","Orion1-4-30-105-E  Transmitter+ Receiver","Hand",1050,928,1056.3,0.2,20,18,"Muting, blanking"]
[null,"2TLA022303R0700","Orion1-4-30-120-E  Transmitter+ Receiver","Hand",1200,928,1206.3,0.2,20,19,"Muting, blanking"]
[null,"2TLA022303R0800","Orion1-4-30-135-E  Transmitter+ Receiver","Hand",1350,928,1356.3,0.2,20,19,"Muting, blanking"]
[null,"2TLA022303R0900","Orion1-4-30-150-E  Transmitter+ Receiver","Hand",1500,928,1506.3,0.2,20,20,"Muting, blanking"]
[null,"2TLA022303R1000","Orion1-4-30-165-E  Transmitter+ Receiver","Hand",1650,928,1656.3,0.2,20,21,"Muting, blanking"]
[null,"2TLA022303R1100","Orion1-4-30-180-E  Transmitter+ Receiver","Hand",1800,928,1806.3,0.2,20,22,"Muting, blanking"]
[null,"2TLA022304R0000","Orion2-4-K2-050-B Transmitter+ Receiver ","Body",500,1650,664,0.5,50,14,"No"]
[null,"2TLA022304R0100","Orion2-4-K3-080-B Transmitter+ Receiver ","Body",800,1650,964,0.5,50,14,"No"]
[null,"2TLA022304R0200","Orion2-4-K4-090-B Transmitter+ Receiver ","Body",900,1650,1064,0.5,50,16,"No"]
[null,"2TLA022304R0300","Orion2-4-K4-120-B Transmitter+ Receiver ","Body",1200,1650,1364,0.5,50,16,"No"]
[null,"2TLA022305R0000","Orion2-4-K2-050-E Transmitter+ Receiver ","Body",500,1650,664,0.5,50,14,"Muting"]
[null,"2TLA022305R0100","Orion2-4-K3-080-E Transmitter+ Receiver ","Body",800,1650,964,0.5,50,14,"Muting"]
[null,"2TLA022305R0200","Orion2-4-K4-090-E Transmitter+ Receiver ","Body",900,1650,1064,0.5,50,16,"Muting"]
[null,"2TLA022305R0300","Orion2-4-K4-120-E  Transmitter+ Receiver","Body",1200,1650,1364,0.5,50,16,"Muting"]
[null,"2TLA022306R0000","Orion3-4-K1C-050-B - Active unit","Body",500,1650,606.35,0.5,8,11,"No"]
[null,"2TLA022306R0100","Orion3-4-K2C-080-B - Active unit","Body",800,1650,906.35,0.5,8,12,"No"]
[null,"2TLA022306R0200","Orion3-4-K2C-090-B - Active unit","Body",900,1650,1006.35,0.5,6.5,12,"No"]
[null,"2TLA022306R0300","Orion3-4-K2C-120-B - Active unit","Body",1200,1650,1306.3499999999999,0.5,8,12,"No"]
[null,"2TLA022307R0000","Orion3-4-K1C-050-E - Active unit","Body",500,1650,606.35,0.5,8,11,"Muting"]
[null,"2TLA022307R0100","Orion3-4-K2C-080-E - Active unit","Body",800,1650,906.35,0.5,8,12,"Muting"]
[null,"2TLA022307R0200","Orion3-4-K2C-090-E - Active unit","Body",900,1650,1006.35,0.5,6.5,12,"Muting"]
[null,"2TLA022307R0300","Orion3-4-K2C-120-E - Active unit","Body",1200,1650,1306.3499999999999,0.5,8,12,"Muting"]